{"text_format":"1","workbook":"xlsx","n_sheets":17,"sheets":["Innehåll","Fondval & marknadsvärde","10 mest valda fonder","Fondstatistik","Värdeutveckling, konto","Värdeutv. Premiepensionssystem","Värdeutv. fondrörelse per år","Marknadsv. & tillfört kapital","Värdeutveckling - fondrörelse","Värdeutv fondrörelse genomsnitt","Avkastning pp-systemet","Index, fondrörelsen","Marknadsv. och tillfört kapital","Avkastning sedan 2000","Ordlista","Beskrivning av mått","Info Makro"],"not_rendered":{"charts":6,"images":7,"macros":1,"external_links":1,"defined_names":23,"comments":0,"pivot_tables":0},"unopened":[],"bounds":{"document_bytes":16777216,"sheet_cells":100000,"rows_first":2000,"rows_last":500,"rows_between":2000,"halvings":0,"cell_chars":16384,"cell_head_chars":4096},"cells_cut":0,"cells_raw":0,"read":"whole","date_system":"1900"}

{"sheet":"Innehåll","index":0,"n_rows":23,"n_cols":2,"rows_kept":23,"cut":false,"hidden":false,"merged":[]}
[]
[]
[]
[]
[]
[]
[]
[null,"INNEHÅLLSFÖRTECKNING"]
[null,"(klicka på resp rubrik för att komma till sidan)"]
[]
[null,"Fondval och aktuellt marknadsvärde"]
[null,"De tio mest valda fonderna m.m"]
[null,"Fondstatistik"]
[null,"Värdeutveckling - individuella konton"]
[null,"Värdeutveckling - pensionssystemet"]
[null,"Värdeutveckling för fondrörelsen per kalenderår"]
[null,"Marknadsvärde och tillfört kapital till fondrörelsen"]
[null,"Värdeutveckling för premiepensionsfondernas index"]
[null,"Värdeutveckling för fondrörelsen i genomsnitt per år"]
[null,""]
[null,"Beskrivning av mått"]
[]
[null,"Ordlista"]

{"sheet":"Fondval & marknadsvärde","index":1,"n_rows":798,"n_cols":12,"rows_kept":798,"cut":false,"hidden":false,"merged":[[16,2,16,4],[16,5,16,7]]}
[]
["Antal fondval och marknadsvärde i fonderna 2012-03-31"]
[]
["Antal fondval, visar aktuellt läge vid månadsslut. "]
["Marknadsvärde = Fondandelar * Fondkurs * Valutakurs."]
[]
["För att sortera tabellen så kan man klicka på resp rubrik och därefter på A-Ö eller Ö-A - knapparna i verktygsfältet ovan."]
["Alternativt välj menyn Data och välj Sortera"]
[]
[]
[]
["Klicka på resp rubrik för att sortera (stigande eller fallande)"]
[]
[]
[]
[]
[null,null,"Antal fondval",null,null,"Marknadsvärde",null,null,"Svensk/ "]
["Fondkategori","Fondnamn","Kvinnor","Män","Total","Kvinnor","Män","Total","Utländsk","Fondtyp","Fondnr","Förvaltare"]
["Statens förvaltningsalternativ ","AP7 Såfa",1325536,1429038,2754574,51793223189.158348,66117706667.263008,117910929856.42116,"Svensk","Generationsfonder",1,"Sjunde AP-fonden"]
["Övriga branscher","Swedbank Robur Technology",138191,143227,281418,2600445874.81423,3462929630.8299999,6063375505.6442204,"Svensk","Aktiefonder",283408,"Swedbank Robur Fonder AB"]
["Sverige","AMF Aktiefond Sverige",131002,139176,270178,4520466003.1516895,6058630866.7245502,10579096869.8762,"Svensk","Aktiefonder",681783,"AMF Fonder AB"]
["Svenska och utländska aktier","AMF Aktiefond Världen",119202,122319,241521,3613130615.6600699,4748145131.5489798,8361275747.2090397,"Svensk","Aktiefonder",645952,"AMF Fonder AB"]
["Sverige","Didner & Gerge Aktiefond",116216,123292,239508,4327076721.7641201,5633828706.05653,9960905427.8206501,"Svensk","Aktiefonder",291906,"Didner & Gerge Fonder AB"]
["Nya marknader","SKAGEN Kon-Tiki",107135,122520,229655,1988499834.0583999,2944157817.2663598,4932657651.3247604,"Utländsk","Aktiefonder",501981,"SKAGEN Fonder"]
["Svenska och utländska aktier","Swedbank Robur Aktiefond Pension",92704,78083,170787,3374275481.7170701,3466465647.0032701,6840741128.7203503,"Svensk","Aktiefonder",785022,"Swedbank Robur Fonder AB"]
["Pension om mer än 20 år","Swedbank Robur Transfer 80",68551,72087,140638,4158908072.83184,5434807273.53232,9593715346.3641605,"Svensk","Generationsfonder",747899,"Swedbank Robur Fonder AB"]
["Global","SKAGEN Global",66711,72228,138939,1597361219.8892601,2135008565.6070399,3732369785.4963002,"Utländsk","Aktiefonder",984187,"SKAGEN Fonder"]
["Läkemedel","Swedbank Robur Medica",70547,65397,135944,1070155263.1441,1280278651.34797,2350433914.4920702,"Svensk","Aktiefonder",928341,"Swedbank Robur Fonder AB"]
["Pension om mer än 20 år","Swedbank Robur Transfer 70",72523,57070,129593,5125289330.4390001,4776437618.8361597,9901726949.2751503,"Svensk","Generationsfonder",783720,"Swedbank Robur Fonder AB"]
["Svenska och utländska aktier samt svenska räntor","AMF Balansfond",66991,59802,126793,2279371532.9868102,2532082114.72328,4811453647.7100897,"Svensk","Blandfonder",610121,"AMF Fonder AB"]
{"$rows_left_out":769}
{"sheet":"10 mest valda fonder","index":2,"n_rows":46,"n_cols":10,"rows_kept":46,"cut":false,"hidden":false,"merged":[[6,2,6,4],[6,5,6,7],[20,5,20,7],[20,2,20,4]]}
[]
[null,"Fondstatistik per 2012-03-31"]
[]
[]
[]
[null,"De tio mest valda fonderna"]
[null,null,"Antal fondval",null,null,"Marknadsvärde",null,null,"Värdeutveckling"]
[null,"Fondnamn","Kvinnor","Män","Total","Kvinnor","Män","Total",2012]
[null,"AP7 Såfa",1325536,1429038,2754574,51793223189.158348,66117706667.263008,117910929856.42116]
[null,"Swedbank Robur Technology",138191,143227,281418,2600445874.81423,3462929630.8299999,6063375505.6442204,{"$f":"VLOOKUP($B$9:$B$18,Fondstatistik!$A$19:$S$919,2,FALSE)","v":13}]
[null,"AMF Aktiefond Sverige",131002,139176,270178,4520466003.1516895,6058630866.7245502,10579096869.8762,{"$f":"VLOOKUP($B$9:$B$18,Fondstatistik!$A$19:$S$919,2,FALSE)","v":11}]
[null,"AMF Aktiefond Världen",119202,122319,241521,3613130615.6600699,4748145131.5489798,8361275747.2090397,{"$f":"VLOOKUP($B$9:$B$18,Fondstatistik!$A$19:$S$919,2,FALSE)","v":10}]
[null,"Didner & Gerge Aktiefond",116216,123292,239508,4327076721.7641201,5633828706.05653,9960905427.8206501,{"$f":"VLOOKUP($B$9:$B$18,Fondstatistik!$A$19:$S$919,2,FALSE)","v":19}]
[null,"SKAGEN Kon-Tiki",107135,122520,229655,1988499834.0583999,2944157817.2663598,4932657651.3247604,{"$f":"VLOOKUP($B$9:$B$18,Fondstatistik!$A$19:$S$919,2,FALSE)","v":10}]
[null,"Swedbank Robur Aktiefond Pension",92704,78083,170787,3374275481.7170701,3466465647.0032701,6840741128.7203503,{"$f":"VLOOKUP($B$9:$B$18,Fondstatistik!$A$19:$S$919,2,FALSE)","v":9}]
[null,"Swedbank Robur Transfer 80",68551,72087,140638,4158908072.83184,5434807273.53232,9593715346.3641605,{"$f":"VLOOKUP($B$9:$B$18,Fondstatistik!$A$19:$S$919,2,FALSE)","v":7}]
[null,"SKAGEN Global",66711,72228,138939,1597361219.8892601,2135008565.6070399,3732369785.4963002,{"$f":"VLOOKUP($B$9:$B$18,Fondstatistik!$A$19:$S$919,2,FALSE)","v":11}]
[null,"Swedbank Robur Medica",70547,65397,135944,1070155263.1441,1280278651.34797,2350433914.4920702,{"$f":"VLOOKUP($B$9:$B$18,Fondstatistik!$A$19:$S$919,2,FALSE)","v":2}]
[]
[null,"De tio fonderna med mest kapital"]
[null,null,"Antal fondval",null,null,"Marknadsvärde",null,null,"Värdeutveckling"]
[null,"Fondnamn","Kvinnor","Män","Total","Kvinnor","Män","Total",2012]
[null,"AP7 Såfa",1325536,1429038,2754574,51793223189.158348,66117706667.263008,117910929856.42116]
[null,"AMF Aktiefond Sverige",131002,139176,270178,4520466003.1516895,6058630866.7245502,10579096869.8762,{"$f":"VLOOKUP($B$23:$B$32,Fondstatistik!$A$19:$S$919,2,FALSE)","v":11}]
[null,"Didner & Gerge Aktiefond",116216,123292,239508,4327076721.7641201,5633828706.05653,9960905427.8206501,{"$f":"VLOOKUP($B$23:$B$32,Fondstatistik!$A$19:$S$919,2,FALSE)","v":19}]
[null,"Swedbank Robur Transfer 70",72523,57070,129593,5125289330.4390001,4776437618.8361597,9901726949.2751503,{"$f":"VLOOKUP($B$23:$B$32,Fondstatistik!$A$19:$S$919,2,FALSE)","v":6}]
[null,"Swedbank Robur Transfer 80",68551,72087,140638,4158908072.83184,5434807273.53232,9593715346.3641605,{"$f":"VLOOKUP($B$23:$B$32,Fondstatistik!$A$19:$S$919,2,FALSE)","v":7}]
[null,"AMF Aktiefond Världen",119202,122319,241521,3613130615.6600699,4748145131.5489798,8361275747.2090397,{"$f":"VLOOKUP($B$23:$B$32,Fondstatistik!$A$19:$S$919,2,FALSE)","v":10}]
[null,"Swedbank Robur Aktiefond Pension",92704,78083,170787,3374275481.7170701,3466465647.0032701,6840741128.7203503,{"$f":"VLOOKUP($B$23:$B$32,Fondstatistik!$A$19:$S$919,2,FALSE)","v":9}]
[null,"Swedbank Robur Technology",138191,143227,281418,2600445874.81423,3462929630.8299999,6063375505.6442204,{"$f":"VLOOKUP($B$23:$B$32,Fondstatistik!$A$19:$S$919,2,FALSE)","v":13}]
{"$rows_left_out":17}
{"sheet":"Fondstatistik","index":3,"n_rows":824,"n_cols":20,"rows_kept":824,"cut":false,"hidden":false,"merged":[[16,1,16,8],[16,9,16,10]]}
[]
["Fondstatistik per 2012-03-31"]
[]
[]
[]
[]
["För att sortera tabellen, klicka på respektive rubrik och därefter på A-Ö eller Ö-A Knapparna i verktygsfältet ovan."]
["Alternativt välj menyn Data och välj Sortera"]
[]
[]
[]
["Klicka på resp rubrik för att sortera (stigande eller fallande)"]
[]
[]
[]
[]
[null,"Värdeutveckling i SEK (%)",null,null,null,null,null,null,null,"Fondavgift (%)",null,null,"Sharpe-","Noterings-",null,"Svensk/"]
["Fondnamn","I år","1 mån","3 mån.","6 mån.","12 mån.","36 mån.","60 mån.","Snitt 5 år","Netto","Brutto (TER)","Risk","kvot","valuta","Startdatum","Utländsk","Fondnummer","Förvaltare","Fondkategori","Etisk"]
["Avanza Zero - Fonden utan avgifter",11,-1,10,21,-2,68,6,1.2,0,0,15.9,1.1000000000000001,"SEK",2006,"Svensk",734491,"Avanza Fonder AB","Sverige index"]
["AP7 Räntefond",0,0,0,1,4,null,null,null,0.09,0.09,null,null,"SEK",2010,"Svensk",545541,"Sjunde AP-Fonden","Sverige lång","Fonden tar miljö och/eller etisk hänsyn"]
["Öhman Penningmarknadsfond",0,0,0,1,2,3,9,1.8,0.1,0.106765,0.2,0.2,"SEK",2001,"Svensk",294918,"E. Öhman J:or Fonder AB","Sverige kort"]
["Spiltan Räntefond Sverige",1,0,1,2,3,7,null,null,0.1,0.119616,0.3,5.3,"SEK",2008,"Svensk",972497,"Spiltan Fonder AB","Sverige kort"]
["AMF Räntefond Lång",-1,0,-1,1,11,18,37,6.4,0.11,0.15,4.0999999999999996,1.2,"SEK",2000,"Svensk",574293,"AMF Fonder AB","Sverige lång"]
["SPP Obligationsfond",-1,0,0,1,10,15,30,5.4,0.11,0.2,3.1,1.2,"SEK",2000,"Svensk",534800,"SPP Fonder AB","Sverige lång","Fonden tar miljö och/eller etisk hänsyn"]
["Öhman Obligationsfond",0,0,0,1,8,13,26,4.7,0.11,0.136847,2.2999999999999998,1.4,"SEK",2001,"Svensk",330746,"E. Öhman J:or Fonder AB","Sverige lång"]
["AMF Räntefond kort",1,0,1,2,3,7,15,2.9,0.11,0.15,0.4,3.6,"SEK",2004,"Svensk",305185,"AMF Fonder AB","Sverige kort"]
["SPP Penningsmarknadsfond",1,0,1,2,2,6,13,2.4,0.11,0.2,0.5,2,"SEK",2010,"Svensk",442897,"SPP Fonder AB","Sverige kort","Fonden tar miljö och/eller etisk hänsyn"]
["Folksams Obligationsfond",-1,0,-1,1,9,14,30,5.3,0.12,0.3,3.2,1.1000000000000001,"SEK",2000,"Svensk",578542,"Folksam Fond AB","Sverige lång","Fonden tar miljö och/eller etisk hänsyn"]
["Simplicity Likviditet",1,0,1,1,3,5,15,2.8,0.12,0.16,0.3,2.9,"SEK",2006,"Svensk",418699,"Simplicity AB","Sverige kort"]
["Folksams Penningmarknadsfond",1,0,1,1,3,5,14,2.6,0.12,0.3,0.3,2.5,"SEK",2000,"Svensk",614370,"Folksam Fond AB","Sverige kort","Fonden tar miljö och/eller etisk hänsyn"]
{"$rows_left_out":795}
{"sheet":"Värdeutveckling, konto","index":4,"n_rows":58,"n_cols":7,"rows_kept":58,"cut":false,"hidden":false,"merged":[]}
[]
[]
[]
[]
[]
[]
[]
[]
[]
[]
[]
[]
[]
[]
[]
[]
[]
[]
[]
[]
[]
[]
[]
[]
[]
[]
[]
[]
[]
[]
{"$rows_left_out":29}
{"sheet":"Värdeutv. Premiepensionssystem","index":5,"n_rows":66,"n_cols":2,"rows_kept":66,"cut":false,"hidden":false,"merged":[]}
[]
[]
[]
[]
[]
[]
[]
[]
[]
[]
[]
[]
[]
[]
[]
[]
[]
[]
[]
[]
[]
[]
[]
[]
[]
[]
[]
[]
[]
[]
{"$rows_left_out":37}
{"sheet":"Värdeutv. fondrörelse per år","index":6,"n_rows":47,"n_cols":2,"rows_kept":47,"cut":false,"hidden":false,"merged":[]}
[]
[]
[]
[]
[]
[]
[]
[]
[]
[]
[]
[]
[]
[]
[]
[]
[]
[]
[]
[]
[]
[]
[]
[]
[]
[]
[]
[]
[]
[]
{"$rows_left_out":18}
{"sheet":"Marknadsv. & tillfört kapital","index":7,"n_rows":41,"n_cols":2,"rows_kept":41,"cut":false,"hidden":false,"merged":[]}
[]
[]
[]
[]
[]
[]
[]
[]
[]
[]
[]
[]
[]
[]
[]
[]
[]
[]
[]
[]
[]
[]
[]
[]
[]
[]
[]
[]
[]
[]
{"$rows_left_out":12}
{"sheet":"Värdeutveckling - fondrörelse","index":8,"n_rows":44,"n_cols":2,"rows_kept":44,"cut":false,"hidden":false,"merged":[]}
[]
[]
[]
[]
[]
[]
[]
[]
[]
[]
[]
[]
[]
[]
[]
[]
[]
[]
[]
[]
[]
[]
[]
[]
[]
[]
[]
[]
[]
[]
{"$rows_left_out":15}
{"sheet":"Värdeutv fondrörelse genomsnitt","index":9,"n_rows":45,"n_cols":2,"rows_kept":45,"cut":false,"hidden":false,"merged":[]}
[]
[]
[]
[]
[]
[]
[]
[]
[]
[]
[]
[]
[]
[]
[]
[]
[]
[]
[]
[]
[]
[]
[]
[]
[]
[]
[]
[]
[]
[]
{"$rows_left_out":16}
{"sheet":"Avkastning pp-systemet","index":10,"n_rows":159,"n_cols":6,"rows_kept":159,"cut":false,"hidden":false,"merged":[[20,2,21,2],[20,4,21,4],[20,3,21,3],[20,5,21,5]]}
[]
[null,"Värdeutveckling - Premiepensionssystemet"]
[]
[null,"Siffrorna omfattar både avkastningen i fondrörelsen och avkastningen av pengarna fram till tidpunkten då de placerades i fonderna."]
[null,"Kapitalviktad avkastning anger genomsnittlig årlig utveckling för en genomsnittlig persons premiepensionskonto. "]
[null,"Måttet kan jämföras med räntan på ett bankkonto."]
[null,"Den kapitalviktade avkastningen kan inte jämföras med marknadsindex eller med enskilda fonders avkastning. "]
[null,"Balansindex är den siffra med vilken inkomstpensionen räknas upp årligen och är jämförbar med den kapitalviktade årsavkastningen."]
[]
[null,"I tabellen nedan kan man därför jämföra den genomsnittlige personens avkastning i premiepensionssystemet med personens avkastning i inkomstpensionen. "]
[]
[null,"Med årsavkastning avses genomsnittlig årsavkastning sedan start."]
[]
[]
[]
[]
[]
[]
[]
[]
[null,null,"Kapitalviktad \nårsavkastning (IR)","Real kapitalviktad årsavkastning (IR)","Balansindex, (IR)","Balansindex, realt (IR)"]
[]
[null,"2000-12-13",4.1944485443448101E-2,3.4185081486749702E-2]
[null,"2000-12-31",2.9213223139710559E-2,2.1548629423359555E-2,2.136166095733642E-2,1.4385435572878524E-2]
[null,"2001-01-31",3.4470444993645266E-2,2.7404682439887473E-2]
[null,"2001-02-28",1.5265800868734553E-2,7.8503517895816E-3]
[null,"2001-03-31",-1.8410568162869163E-3,-1.0267239300616793E-2]
[null,"2001-04-30",2.0691238008785837E-2,1.0771200659497771E-2]
[null,"2001-05-31",2.985371110015975E-2,1.8881108471976438E-2]
[null,"2001-06-30",2.1832256757043877E-2,1.1325475944840457E-2]
{"$rows_left_out":130}
{"sheet":"Index, fondrörelsen","index":11,"n_rows":17,"n_cols":14,"rows_kept":17,"cut":false,"hidden":false,"merged":[]}
[" "]
[null,"Värdeutveckling - fondrörelsen per kalenderår"]
[]
[null,"Avkastningen i fondrörelsen mäter avkastningen på en genomsnittlig krona som sattes in i början på året. "]
[null," "]
[null,"Det kan jämföras med marknadsindex och enskilda fonders avkastning. "]
[]
[null,"Rabatter på fondavgifter, myndighetens avgift och arvsvinster är inte medräknade."]
[]
[]
[null,null,2001,2002,2003,2004,2005,"2006-12-31",2007,2008,2009,2010,2011,"2012-03-31"]
[null,"Värdeutveckling i fondrörelsen",-0.111,-0.31223079839764201,0.1782730775091621,8.7501758829949594E-2,0.30552648011758543,0.12140116450721394,5.6636805614445285E-2,-0.34156819000074978,0.34685505788951732,0.12151293044644662,-0.10687426681227297,9.5575272304935899E-2]
[null,"Sjunde AP-fonden",-0.106,-0.26700000000000002,0.187,0.10100000000000001,0.251,0.105,4.7E-2,-0.36199999999999999,0.35141800246609134,0.14644453351666153,-0.10536246609942557,0.13651204193203559]
[]
[]
[null,"I beräkningen av värdeutvecklingen i fondrörelsen ingår alla fonder på fondtorget inklusive AP7 Aktiefond och AP7 Räntefond."]
[null,"I beräkningen av värdeutveckling för Sjunde AP-fondens förvaltning ingår AP7 Aktiefond och AP7 Räntefond."]

{"sheet":"Marknadsv. och tillfört kapital","index":12,"n_rows":13,"n_cols":15,"rows_kept":13,"cut":false,"hidden":false,"merged":[]}
[]
[null,"Marknadsvärde och tillfört kapital till fondrörelsen"]
[]
[null,"Tillfört kapital är pengar från den tillfälliga förvaltningen (inklusive ränta) samt återförda fondavgifter och arvsvinster. "]
[null,"Från det tillförda kapitalet har det dragits av för pensionsutbetalningar, myndighetens avgift, samt överföringar till "]
[null,"traditionell försäkring. Jämförelsen mellan marknadsvärde och tillfört kapital ger alltså inte en fullständig bild av "]
[null,"utvecklingen av de inbetalda pensionsrätterna."]
[]
[]
[]
[null,null,2000,2001,2002,2003,2004,2005,"2006-12-31","2007-12-31","2008-01-01","2009-12-31","2010-12-31","2011-12-31","2012-03-31"]
[null,"Netto tillfört kapital, mdr",55.831616023629408,74.033547998326426,93.93715098490317,114.64956724755694,136.62021154457284,159.77779842054943,209,235.50159071018251,263.98657166722467,293.39683174242759,323.04324834873717,354.29697772737427,353.53767967627442]
[null,"Marknadsvärde, mdr",52.735199475111202,65.023593666597904,59.275358189472996,93.920076415257597,124.75628531142399,192.35696213467801,267,308.29568458589898,230.23493756186801,340.16227208294498,408.47751268748601,393.15689279941199,429.59516211074401]

{"sheet":"Avkastning sedan 2000","index":13,"n_rows":156,"n_cols":6,"rows_kept":156,"cut":false,"hidden":false,"merged":[[17,13,18,13],[17,14,18,14],[17,2,18,2],[17,3,18,3],[17,4,18,4],[17,5,18,5],[17,11,18,11],[17,12,18,12]]}
[]
[null,"Värdeutveckling - fondrörelsen i genomsnitt per år"]
[]
[]
[]
[]
[null,"TVA, tidsviktad avkastning, mäter avkastningen på en genomsnittlig krona som sattes in i premiepensionssystemet 2000-12-13. "]
[null,"Premiepensionsindex kan jämföras med marknadsindex och enskilda fonders avkastning. Rabatten på fondavgiften, myndighetens avgift och arvsvinster är inte medräknade. "]
[]
[null,"Real avkastning = avkastning/inflation (KPI) "]
[null,"Med årsavkastningn menas genomsnittlig avkastning sedan start. "]
[]
[]
[]
[]
[]
[]
[null,null,"Tidsviktad årsavkastning (TVA)","Real tidsviktad årsavkastning (TVA)","Tidsviktad avkastning sedan start (TVA)","Real tidsviktad avkastning sedan start (TVA)"]
[]
[null,"2000-12-13",0,0,0]
[null,"2000-12-31",-4.5388155165690725E-2,-4.4660831855340755E-2,-4.5388155165690725E-2,-4.4660831855340755E-2]
[null,"2001-01-31",-2.3061835549637144E-2,-1.9328789449330031E-2,-2.3061835549637144E-2,-1.9328789449330031E-2]
[null,"2001-02-28",-9.3336214097018311E-2,-9.2990949898273945E-2,-9.3336214097018311E-2,-9.2990949898273945E-2]
[null,"2001-03-31",-0.15455948709528244,-0.16063029954622343,-0.15455948709528244,-0.16063029954622343]
[null,"2001-04-30",-0.10298425231858033,-0.1170998991535821,-0.10298425231858033,-0.1170998991535821]
[null,"2001-05-31",-7.016137882463358E-2,-9.0924429539379514E-2,-7.016137882463358E-2,-9.0924429539379514E-2]
[null,"2001-06-30",-9.557327690967421E-2,-0.11445061440242799,-9.557327690967421E-2,-0.11445061440242799]
[null,"2001-07-31",-0.13384481410068805,-0.14747483201292899,-0.13384481410068805,-0.14747483201292899]
[null,"2001-08-31",-0.18550338163818569,-0.20041755738546863,-0.18550338163818569,-0.20041755738546863]
[null,"2001-09-30",-0.25676123723683508,-0.27658828092670085,-0.25676123723683508,-0.27658828092670085]
{"$rows_left_out":127}
{"sheet":"Ordlista","index":14,"n_rows":58,"n_cols":8,"rows_kept":58,"cut":false,"hidden":false,"merged":[]}
[]
[null,null,"Ordlista"]
[]
[]
[null,null,"Fondavgift brutto, TER"]
[null,null,"I fondavgiften ingår fondens förvaltningsavgift och övriga administrativa kostnader, men inte transaktionskostnader, kupongskatt, "]
[null,null,"räntekostnader eller valutaförluster. "]
[]
[null,null,"Fondavgift netto (TER minus rabatt)",null,null,null,null,"   "]
[null,null,"Den årliga fondavgiften anges i procent efter att Pensionsmyndighetens rabatt dragits av. I fondavgiften ingår fondens förvaltningsavgift och övriga administrativa kostnader, men inte "]
[null,null,"transaktionskostnader, kupongskatt, räntekostnader eller valutaförluster. Rabatten baseras på hur mycket premiepensionspengar det finns i en fond; ju större en fond är i"]
[null,null,"premiepensionssystemet, desto mer rabatt går tillbaka till dem som sparar i fonden."]
[]
[null,null,"TKA"]
[null,null,"TKA, ett mått för totala kostnader inklusive förvaltningsavgifter, skatter och transaktionskostnader. Courtage ingår."]
[]
[null,null,"Fondnummer"]
[null,null,"I premiepensionssystemet har varje fond ett nummer med sex siffror. Använd numret för en fond när du vill välja eller byta fonden. "]
[]
[null,null,"Marknadsvärde"]
[null,null,"Marknadsvärde = Andelar x Fondkurs x Valutakurs."]
[null,null,"Exempel: Anta att du har 12 fondandelar i en fond som handlas i valutan Euro. Priset för en fondandel är 25 Euro. En Euro kostar 9,71 svenska kronor (SEK) per 2010-05-06."]
[null,null,"Marknadsvärdet på fondinnehavet blir då: 12 x 25 x 9,71 = 2913 SEK"]
[]
[null,null,"Risk"]
[null,null,"Standardavvikelse, 36 månader, anger hur kursutvecklingen avviker från medelvärdet mellan olika tidsperioder. Högre siffra innebär större variationer och högre risk. Lägre siffra innebär "]
[null,null,"mindre variationer och lägre risk."]
[]
[null,null,"Riskfri ränta"]
[null,null,"Den värdeutveckling som man kan erhålla utan någon finansiell risk. Den riskfria räntan motsvarar ofta räntan på en statsskuldväxel med kort löptid."]
{"$rows_left_out":29}
{"sheet":"Beskrivning av mått","index":15,"n_rows":18,"n_cols":3,"rows_kept":18,"cut":false,"hidden":false,"merged":[]}
[]
[null,null,"Beskrivning av mått"]
[]
[]
[]
[]
[null,null,"Snitt 5 år:                        Geometriska medelvärdet av fondernas värdeutveckling i SEK för de senaste 60 månaderna (5 år)."]
[]
[null,null,"Risk:                               Standardavvikelse, 36 månader, anger hur kursutvecklingen avviker från medelvärdet."]
[]
[null,null,"Fondavgift, % netto:       TER minus myndighetens rabatt, pensionsspararens avgift till förvaltaren."]
[]
[null,null,"Fondavgift, % brutto:      Motsvarar TER. "]
[]
[null,null,"TER:                               (Total expence ratio) När myndighetens rabatt på fondavgiften beräknas används TER. I TER ingår fondens alla "]
[null,null,"                                       kostnader utom transaktionskostnader, kupongskatt, räntekostnader eller valutaförluster."]
[]
[null,null,"Sharpe-kvot:                   Ett mått på riskjusterad avkastning. Sharpe-kvot = (Värdeutvecklingen hos fonden - riskfria räntan) / Standardavvikelsen hos fonden (risk)."]

{"sheet":"Info Makro","index":16,"n_rows":25,"n_cols":2,"rows_kept":25,"cut":false,"hidden":false,"merged":[]}
[]
[]
[null,"För att kunna få tillgång till enkel sorteringsfunktionalitet i vissa blad behöver man aktivera makron."]
[null,"Detta görs genom att klicka på \"Aktivera makron\" när detta dokument öppnas (se nedan). "]
[null,"Har du valt att klicka på \"Inaktivera makron\" när detta dokument öppnades och vill kunna använda"]
[null,"sorteringsfunktionaliteten måste du stänga dokumentet och öppna på nytt med valet \"Aktivera makron\"."]
[]
[null,"Man kan även sortera manuellt om man inte vill utnyttja makrofunktionaliteten. Gå då direkt till"]
[null,"innehållsförteckningen genom att klicka på knappen här bredvid."]
[]
[]
[]
[]
[]
[]
[]
[]
[]
[]
[]
[]
[]
[null,"Kan du ändå inte sortera?"]
[null,"Då kan inställningarna till säkerhetsnivån för makron vara för hög på din dator. Ett alternativ"]
[null,"kan då vara att kontakta nätverksadministratören på din arbetsplats."]