{"text_format":"1","workbook":"xlsx","n_sheets":16,"sheets":["Innehåll","Fondval & marknadsvärde","10 mest valda fonder","Fondstatistik","Värdeutveckling - konto","Värdeutv. Premiepensionssystem","Värdeutv. fondrörelse per år","Marknadsv. & tillfört kapital","Värdeutveckling - fondrörelse","Värdeutv fondrörelse genomsnitt","Avkastning pp-systemet","Index, fondrörelsen","Marknadsv. och tillfört kapital","Avkastning sedan 2000","Beskrivning av mått","Info Makro"],"not_rendered":{"charts":6,"images":8,"macros":1,"external_links":1,"defined_names":22,"comments":0,"pivot_tables":0},"unopened":[],"bounds":{"document_bytes":16777216,"sheet_cells":100000,"rows_first":2000,"rows_last":500,"rows_between":2000,"halvings":0,"cell_chars":16384,"cell_head_chars":4096},"cells_cut":0,"cells_raw":0,"read":"whole","date_system":"1900"}

{"sheet":"Innehåll","index":0,"n_rows":25,"n_cols":2,"rows_kept":25,"cut":false,"hidden":false,"merged":[]}
[]
[]
[]
[]
[]
[]
[]
[null,"Månadsstatistik om premiepension"]
[]
[null,"INNEHÅLLSFÖRTECKNING"]
[null,"(klicka på resp rubrik för att komma till sidan)"]
[]
[null,"Fondval och aktuellt marknadsvärde"]
[null,"De tio mest valda fonderna m.m"]
[null,"Fondstatistik"]
[null,"Värdeutveckling - individuella konton"]
[null,"Värdeutveckling - pensionssystemet"]
[null,"Värdeutveckling för fondrörelsen per kalenderår"]
[null,"Marknadsvärde och tillfört kapital till fondrörelsen"]
[null,"Värdeutveckling för premiepensionsfondernas index"]
[null,"Värdeutveckling för fondrörelsen i genomsnitt per år"]
[null,""]
[null,"Beskrivning av mått"]
[]
[null,"Ordlista"]

{"sheet":"Fondval & marknadsvärde","index":1,"n_rows":856,"n_cols":12,"rows_kept":856,"cut":false,"hidden":false,"merged":[[20,2,20,4],[20,5,20,7]]}
[]
[]
[]
[]
[]
["Antal fondval och marknadsvärde i fonderna 2016-02-29",null,"Nästa uppdatering: 2016-04-08"]
[]
["Antal fondval, visar aktuellt läge vid månadsslut. "]
["Marknadsvärde = Fondandelar * Fondkurs * Valutakurs."]
["För att sortera tabellen så kan man klicka på resp rubrik och därefter på A-Ö eller Ö-A - knapparna i verktygsfältet ovan. Alternativt välj menyn Data och välj Sortera"]
["Klicka på resp rubrik för att sortera (stigande eller fallande)"]
[]
[]
[]
[]
[]
[]
[]
[null,null,null,null,null,null,null,"För att sortera innehållet på någon särskild variabel, placera dig på rubriken och klicka på!"]
[]
[null,null,"Antal fondval",null,null,"Marknadsvärde",null,null,"Svensk/ "]
["Fondkategori","Fondnamn","Kvinnor","Män","Total","Kvinnor","Män","Total","Utländsk","Fondtyp","Fondnr","Förvaltare"]
["Statens förvaltningsalternativ","AP7 Såfa - Statens årskullsförvaltningsalternativ",1589040,1703363,3292403,111785116595,140561531147,252346647742,"Svensk","Generationsfonder",1,"Sjunde AP-fonden"]
["IT och kommunikation","Swedbank Robur Technology",139901,147842,287743,5534271092,7440640632,12974911724,"Svensk","Aktiefonder",283408,"Swedbank Robur Fonder AB"]
["Sverige","AMF Aktiefond Sverige",116311,124034,240345,7124416366,9499774020,16624190386,"Svensk","Aktiefonder",681783,"AMF Fonder AB"]
["Sverige","Didner & Gerge Aktiefond",112331,123942,236273,8175081887,10827721006,19002802893,"Svensk","Aktiefonder",291906,"Didner & Gerge Fonder AB"]
["Svenska och utländska aktier","AMF Aktiefond Världen",106191,109409,215600,5905817700,7701313037,13607130737,"Svensk","Aktiefonder",645952,"AMF Fonder AB"]
["Svenska och utländska aktier","Swedbank Robur Aktiefond Pension",90339,77443,167782,5447257818,5669580663,11116838480,"Svensk","Aktiefonder",785022,"Swedbank Robur Fonder AB"]
["Pension om mer än 20 år","Swedbank Robur Transfer 80",64876,65999,130875,7372002375,9257896678,16629899052,"Svensk","Generationsfonder",747899,"Swedbank Robur Fonder AB"]
["Läkemedel","Swedbank Robur Medica",64917,61810,126727,2498133231,3063498790,5561632021,"Svensk","Aktiefonder",928341,"Swedbank Robur Fonder AB"]
["Svenska och utländska aktier samt svenska räntor","AMF Balansfond",63860,58160,122020,3508183980,3973665703,7481849683,"Svensk","Blandfonder",610121,"AMF Fonder AB"]
["Pension om mer än 20 år","Swedbank Robur Transfer 70",67766,52411,120177,8333789086,7625424531,15959213617,"Svensk","Generationsfonder",783720,"Swedbank Robur Fonder AB"]
["Global","Allra Strategi Lagom",53453,55654,109107,4768817473,5561803686,10330621159,"Utländsk","Aktiefonder",286179,"Allra Asset Management S.A."]
["Sverige","Swedbank Robur Sverigefond MEGA",54813,51628,106441,2493717566,2874616731,5368334297,"Svensk","Aktiefonder",789271,"Swedbank Robur Fonder AB"]
["Pension om mindre än 20 år","SPP Generation 60-tal",55282,44359,99641,4351585965,4241183453,8592769418,"Svensk","Generationsfonder",463141,"SPP Fonder AB"]
["Läkemedel","Carnegie Fund - Medical Sub-Fund",47072,43640,90712,1905769014,2105720197,4011489211,"Utländsk","Aktiefonder",313155,"Carnegie Fund Management Company S.A."]
["Sverige index","SPP Aktiefond Sverige",43645,46882,90527,2149437867,2848655262,4998093129,"Svensk","Aktiefonder",212332,"SPP Fonder AB"]
["Global","Swedbank Robur Globalfond MEGA",47287,42858,90145,2181808085,2633705570,4815513655,"Svensk","Aktiefonder",753442,"Swedbank Robur Fonder AB"]
["Övriga branscher","Länsförsäkringar Fastighetsfond",41554,48423,89977,1823254172,2642557098,4465811270,"Svensk","Aktiefonder",313742,"Länsförsäkringar Fondförvaltning AB (publ)"]
["Sverige lång","Swedbank Robur Räntefond Pension",48075,36141,84216,1730797082,1598881239,3329678322,"Svensk","Räntefonder",677534,"Swedbank Robur Fonder AB"]
{"$rows_left_out":817}
{"sheet":"10 mest valda fonder","index":2,"n_rows":50,"n_cols":9,"rows_kept":50,"cut":false,"hidden":false,"merged":[[9,2,9,4],[9,5,9,7],[24,5,24,7],[24,2,24,4]]}
[]
[]
[]
[]
[null,"Fondstatistik per 2016-02-29","Nästa uppdatering: 2016-04-08"]
[]
[]
[]
[null,"De tio mest valda fonderna"]
[null,"Fondnamn","Antal fondval",null,null,"Marknadsvärde",null,null,"Värdeutveckling"]
[null,null,"Kvinnor","Män","Total","Kvinnor","Män","Total",2016]
[null,"AP7 Såfa - Statens årskullsförvaltningsalternativ",1589040,1703363,3292403,111785116595,140561531147,252346647742]
[null,"Swedbank Robur Technology",139901,147842,287743,5534271092,7440640632,12974911724,{"$f":"VLOOKUP($B$12:$B$21,Fondstatistik!$A$24:$R$1000,2,FALSE)","v":-9}]
[null,"AMF Aktiefond Sverige",116311,124034,240345,7124416366,9499774020,16624190386,{"$f":"VLOOKUP($B$12:$B$21,Fondstatistik!$A$24:$R$1000,2,FALSE)","v":-6}]
[null,"Didner & Gerge Aktiefond",112331,123942,236273,8175081887,10827721006,19002802893,{"$f":"VLOOKUP($B$12:$B$21,Fondstatistik!$A$24:$R$1000,2,FALSE)","v":-3}]
[null,"AMF Aktiefond Världen",106191,109409,215600,5905817700,7701313037,13607130737,{"$f":"VLOOKUP($B$12:$B$21,Fondstatistik!$A$24:$R$1000,2,FALSE)","v":-6}]
[null,"Swedbank Robur Aktiefond Pension",90339,77443,167782,5447257818,5669580663,11116838480,{"$f":"VLOOKUP($B$12:$B$21,Fondstatistik!$A$24:$R$1000,2,FALSE)","v":-7}]
[null,"Swedbank Robur Transfer 80",64876,65999,130875,7372002375,9257896678,16629899052,{"$f":"VLOOKUP($B$12:$B$21,Fondstatistik!$A$24:$R$1000,2,FALSE)","v":-4}]
[null,"Swedbank Robur Medica",64917,61810,126727,2498133231,3063498790,5561632021,{"$f":"VLOOKUP($B$12:$B$21,Fondstatistik!$A$24:$R$1000,2,FALSE)","v":-8}]
[null,"AMF Balansfond",63860,58160,122020,3508183980,3973665703,7481849683,{"$f":"VLOOKUP($B$12:$B$21,Fondstatistik!$A$24:$R$1000,2,FALSE)","v":-3}]
[null,"Swedbank Robur Transfer 70",67766,52411,120177,8333789086,7625424531,15959213617,{"$f":"VLOOKUP($B$12:$B$21,Fondstatistik!$A$24:$R$1000,2,FALSE)","v":-3}]
[]
[]
[null,"De tio fonderna med mest kapital"]
[null,"Fondnamn","Antal fondval",null,null,"Marknadsvärde",null,null,"Värdeutveckling"]
[null,null,"Kvinnor","Män","Total","Kvinnor","Män","Total",2016]
[null,"AP7 Såfa - Statens årskullsförvaltningsalternativ",1589040,1703363,3292403,111785116595,140561531147,252346647742]
[null,"Didner & Gerge Aktiefond",112331,123942,236273,8175081887,10827721006,19002802893,{"$f":"VLOOKUP($B$27:$B$36,Fondstatistik!$A$24:$R$1000,2,FALSE)","v":-3}]
[null,"Swedbank Robur Transfer 80",64876,65999,130875,7372002375,9257896678,16629899052,{"$f":"VLOOKUP($B$27:$B$36,Fondstatistik!$A$24:$R$1000,2,FALSE)","v":-4}]
[null,"AMF Aktiefond Sverige",116311,124034,240345,7124416366,9499774020,16624190386,{"$f":"VLOOKUP($B$27:$B$36,Fondstatistik!$A$24:$R$1000,2,FALSE)","v":-6}]
[null,"Swedbank Robur Transfer 70",67766,52411,120177,8333789086,7625424531,15959213617,{"$f":"VLOOKUP($B$27:$B$36,Fondstatistik!$A$24:$R$1000,2,FALSE)","v":-3}]
[null,"AMF Aktiefond Världen",106191,109409,215600,5905817700,7701313037,13607130737,{"$f":"VLOOKUP($B$27:$B$36,Fondstatistik!$A$24:$R$1000,2,FALSE)","v":-6}]
[null,"Swedbank Robur Technology",139901,147842,287743,5534271092,7440640632,12974911724,{"$f":"VLOOKUP($B$27:$B$36,Fondstatistik!$A$24:$R$1000,2,FALSE)","v":-9}]
[null,"Swedbank Robur Aktiefond Pension",90339,77443,167782,5447257818,5669580663,11116838480,{"$f":"VLOOKUP($B$27:$B$36,Fondstatistik!$A$24:$R$1000,2,FALSE)","v":-7}]
[null,"Nordea Generationsfond 60-tal",42863,33736,76599,5556062157,5129509346,10685571503,{"$f":"VLOOKUP($B$27:$B$36,Fondstatistik!$A$24:$R$1000,2,FALSE)","v":-6}]
[null,"Allra Strategi Lagom",53453,55654,109107,4768817473,5561803686,10330621159,{"$f":"VLOOKUP($B$27:$B$36,Fondstatistik!$A$24:$R$1000,2,FALSE)","v":-7}]
[]
[]
[null,"De tio fonderna med högst värdeutveckling, snitt 5 år"]
[null,"Fondnamn",2016,"3 mån.","6 mån.","12 mån.","36 mån.","60 mån.","Snitt 5 år"]
{"$rows_left_out":11}
{"sheet":"Fondstatistik","index":3,"n_rows":852,"n_cols":19,"rows_kept":852,"cut":false,"hidden":false,"merged":[[19,1,19,7],[19,8,19,9]]}
[]
[]
[]
[]
["Fondstatistik per 2016-02-29","Nästa uppdatering: 2016-04-08"]
[]
["För att sortera tabellen, klicka på respektive rubrik och därefter på A-Ö eller Ö-A Knapparna i verktygsfältet ovan."]
["Alternativt välj menyn Data och välj Sortera"]
[]
["Klicka på resp rubrik för att sortera (stigande eller fallande)"]
[]
[]
[]
[]
[]
[]
[]
[null,null,null,null,null,null,null,null,null,null,null,null,null,null,null,null,"För att sortera innehållet på någon särskild variabel, placera dig på rubriken och klicka på!"]
[]
[null,"Värdeutveckling i SEK (%)",null,null,null,null,null,null,"Fondavgift (%)",null,null,"Sharpe-","Noterings-",null,"Svensk/"]
["Fondnamn","I år","3 mån.","6 mån.","12 mån.","36 mån.","60 mån.","Snitt 5 år","Netto","Brutto (TER)","Risk","kvot","valuta","Startdatum","Utländsk","Fondnummer","Förvaltare","Fondkategori","Etisk"]
["Avanza Zero - Fonden utan avgifter",-5,-11,-8,-16,28,46,7.9,0,0,13.5,0.70000000000000007,"SEK",2006,"Svensk",734491,"Avanza Fonder AB","Sverige index"]
["Holberg Kreditt",-6,-12,-14,-18,-12,null,null,0,0,9.2000000000000011,-0.5,"NOK",2012,"Utländsk",980284,"Holberg Fondsforvaltning AS","Övriga utländska"]
["Handelsbanken Funds Pension 40",0,-2,-1,-3,17,null,null,0.01,0.01,3.8000000000000003,1.3,"SEK",2012,"Utländsk",167114,"Handelsbanken Funds","Pension om mindre än 10 år"]
["Handelsbanken Funds Pension 50",-3,-6,-3,-7,31,null,null,0.01,0.01,8.1,1.1000000000000001,"SEK",2012,"Utländsk",314682,"Handelsbanken Funds","Pension om mindre än 10 år"]
["Handelsbanken Funds Pension 60",-6,-10,-6,-11,42,null,null,0.01,0.01,12.4,1,"SEK",2012,"Utländsk",350512,"Handelsbanken Funds","Pension om mindre än 20 år"]
["Handelsbanken Funds Pension 70",-6,-10,-6,-11,42,null,null,0.01,0.01,12.3,1,"SEK",2012,"Utländsk",278853,"Handelsbanken Funds","Pension om mer än 20 år"]
["Handelsbanken Funds Pension 80",-6,-10,-6,-11,42,null,null,0.01,0.01,12.3,1,"SEK",2012,"Utländsk",243022,"Handelsbanken Funds","Pension om mer än 20 år"]
["Handelsbanken Funds Pension 90",-6,-10,-6,-13,null,null,null,0.01,0.01,null,null,"SEK",2015,"Utländsk",337709,"Handelsbanken Funds","Pension om mer än 20 år"]
["Swedbank Robur Penningmarknadsfond",0,0,0,0,1,5,1.1000000000000001,0.01,0.01,0.2,1.1000000000000001,"SEK",2000,"Svensk",717611,"Swedbank Robur Fonder AB","Sverige kort"]
["AP7 Räntefond",0,0,0,1,6,13,2.4,0.05,0.05,0.8,2.1,"SEK",2010,"Svensk",545541,"Sjunde AP-Fonden","Sverige lång","Fonden tar miljö och/eller etisk hänsyn"]
["Swedbank Robur Transfer 80",-4,-7,-5,-9,30,41,7.2,0.05,0.05,9.2000000000000011,1,"SEK",2004,"Svensk",747899,"Swedbank Robur Fonder AB","Pension om mer än 20 år"]
["AMF Räntefond kort",0,0,0,0,3,9,1.8,0.1,0.1,0.4,2.3000000000000003,"SEK",2004,"Svensk",305185,"AMF Fonder AB","Sverige kort"]
["AMF Räntefond Lång",2,1,1,1,12,30,5.4,0.1,0.1,2.3000000000000003,1.5,"SEK",2000,"Svensk",574293,"AMF Fonder AB","Sverige lång"]
["KPA Etisk Räntefond",0,0,0,0,1,5,1.1000000000000001,0.1,0.1,0.2,0.8,"SEK",2000,"Svensk",188664,"Swedbank Robur Fonder AB","Sverige kort","Fonden tar miljö och/eller etisk hänsyn"]
["Spiltan Räntefond Sverige",0,0,0,0,6,12,2.4,0.1,0.11,0.6,2.9,"SEK",2008,"Svensk",972497,"Spiltan Fonder AB","Sverige kort"]
["Öhman Penningmarknadsfond",0,0,0,0,1,3,0.6,0.1,0.11,0.2,-1.6,"SEK",2001,"Svensk",294918,"E. Öhman J:or Fonder AB","Sverige kort"]
["AP7 Aktiefond",-8,-12,-5,-12,63,80,12.5,0.12,0.12,15.700000000000001,1.1000000000000001,"SEK",2010,"Svensk",581371,"Sjunde AP-Fonden","Global","Fonden tar miljö och/eller etisk hänsyn"]
["Öhman Obligationsfond",2,1,0,1,9,22,4,0.11,0.13,2.1,1.3,"SEK",2001,"Svensk",330746,"E. Öhman J:or Fonder AB","Sverige lång"]
["Handelsbanken Funds - Swedish Short Term Asset Shares",0,0,0,0,2,7,1.4000000000000001,0.11,0.16,0.2,2.3000000000000003,"SEK",2000,"Utländsk",718205,"Handelsbanken Funds","Sverige kort"]
{"$rows_left_out":813}
{"sheet":"Värdeutveckling - konto","index":4,"n_rows":45,"n_cols":3,"rows_kept":45,"cut":false,"hidden":false,"merged":[]}
[]
[]
[]
[]
[]
[]
[]
[null,null,"Nästa uppdatering: 2016-04-13"]
[]
[]
[]
[]
[]
[]
[]
[]
[]
[]
[]
[]
[]
[]
[]
[]
[]
[]
[]
[]
[]
[]
[]
[]
[]
[]
[]
[]
[]
[]
[]
[]
{"$rows_left_out":6}
{"sheet":"Värdeutv. Premiepensionssystem","index":5,"n_rows":70,"n_cols":7,"rows_kept":70,"cut":false,"hidden":false,"merged":[]}
[]
[]
[]
[]
[]
[null,null,null,null,null,null,"Nästa uppdatering: 2016-04-13"]
[]
[]
[]
[]
[]
[]
[]
[]
[]
[]
[]
[]
[]
[]
[]
[]
[]
[]
[]
[]
[]
[]
[]
[]
[]
[]
[]
[]
[]
[]
[]
[]
[]
[]
{"$rows_left_out":31}
{"sheet":"Värdeutv. fondrörelse per år","index":6,"n_rows":49,"n_cols":7,"rows_kept":49,"cut":false,"hidden":false,"merged":[]}
[]
[]
[]
[]
[null,null,null,null,null,null,"Nästa uppdatering: 2016-04-13"]
[]
[]
[]
[]
[]
[]
[]
[]
[]
[]
[]
[]
[]
[]
[]
[]
[]
[]
[]
[]
[]
[]
[]
[]
[]
[]
[]
[]
[]
[]
[]
[]
[]
[]
[]
{"$rows_left_out":10}
{"sheet":"Marknadsv. & tillfört kapital","index":7,"n_rows":44,"n_cols":7,"rows_kept":44,"cut":false,"hidden":false,"merged":[]}
[]
[]
[]
[]
[]
[]
[null,null,null,null,null,null,"Nästa uppdatering: 2016-04-13"]
[]
[]
[]
[]
[]
[]
[]
[]
[]
[]
[]
[]
[]
[]
[]
[]
[]
[]
[]
[]
[]
[]
[]
[]
[]
[]
[]
[]
[]
[]
[]
[]
[]
{"$rows_left_out":5}
{"sheet":"Värdeutveckling - fondrörelse","index":8,"n_rows":46,"n_cols":7,"rows_kept":46,"cut":false,"hidden":false,"merged":[]}
[]
[]
[]
[]
[]
[null,null,null,null,null,null,"Nästa uppdatering: 2016-04-13"]
[]
[]
[]
[]
[]
[]
[]
[]
[]
[]
[]
[]
[]
[]
[]
[]
[]
[]
[]
[]
[]
[]
[]
[]
[]
[]
[]
[]
[]
[]
[]
[]
[]
[]
{"$rows_left_out":7}
{"sheet":"Värdeutv fondrörelse genomsnitt","index":9,"n_rows":47,"n_cols":7,"rows_kept":47,"cut":false,"hidden":false,"merged":[]}
[]
[]
[]
[]
[]
[null,null,null,null,null,null,"Nästa uppdatering: 2016-04-13"]
[]
[]
[]
[]
[]
[]
[]
[]
[]
[]
[]
[]
[]
[]
[]
[]
[]
[]
[]
[]
[]
[]
[]
[]
[]
[]
[]
[]
[]
[]
[]
[]
[]
[]
{"$rows_left_out":8}
{"sheet":"Avkastning pp-systemet","index":10,"n_rows":210,"n_cols":6,"rows_kept":210,"cut":false,"hidden":false,"merged":[[24,2,25,2],[24,3,25,3],[24,4,25,4],[24,5,25,5]]}
[]
[]
[]
[]
[null,"Värdeutveckling - Premiepensionssystemet",null,null,null,"Nästa uppdatering 2016-04-13"]
[]
[null,"Siffrorna omfattar både avkastningen i fondrörelsen och avkastningen av pengarna fram till tidpunkten då de placerades i fonderna."]
[null,"Kapitalviktad avkastning anger genomsnittlig årlig utveckling för en genomsnittlig persons premiepensionskonto. "]
[null,"Måttet kan jämföras med räntan på ett bankkonto."]
[null,"Den kapitalviktade avkastningen kan inte jämföras med marknadsindex eller med enskilda fonders avkastning. "]
[null,"Balansindex är den siffra med vilken inkomstpensionen räknas upp årligen och är jämförbar med den kapitalviktade årsavkastningen."]
[]
[null,"I tabellen nedan kan man därför jämföra den genomsnittlige personens avkastning i premiepensionssystemet "]
[null,"med personens avkastning i inkomstpensionen. "]
[]
[null,"Med årsavkastning avses genomsnittlig årsavkastning sedan start."]
[]
[]
[]
[]
[]
[]
[]
[]
[null,"Datum","Kapitalviktad \nårsavkastning (IR)","Real kapitalviktad årsavkastning (IR)","Balansindex, (IR)","Balansindex, realt (IR) *"]
[]
[null,"2000-12-13",4.1944485443448101E-2,3.4185081486749702E-2]
[null,"2000-12-31",2.9172234535217278E-2,2.1548629423359555E-2,2.2797217369079588E-2,1.4385435572878524E-2]
[null,"2001-01-31",3.4470444993645266E-2,2.7404682439887473E-2]
[null,"2001-02-28",1.5265800868734553E-2,7.8503517895816E-3]
[null,"2001-03-31",-1.8410568162869163E-3,-1.0267239300616793E-2]
[null,"2001-04-30",2.0691238008785837E-2,1.0771200659497771E-2]
[null,"2001-05-31",2.985371110015975E-2,1.8881108471976438E-2]
[null,"2001-06-30",2.1832256757043877E-2,1.1325475944840457E-2]
[null,"2001-07-31",9.9048701493387632E-3,4.7028351006228597E-4]
[null,"2001-08-31",-5.8520358709966656E-3,-1.5417734422042306E-2]
[null,"2001-09-30",-2.8352978395008131E-2,-3.8834699205131495E-2]
[null,"2001-10-31",-1.585379730917981E-2,-2.5904718303681462E-2]
[null,"2001-11-30",1.5011297694889443E-3,-8.6559676423678678E-3]
[null,"2001-12-31",4.0387541055679332E-3,-6.1731336402864878E-3,2.3982968330383304E-2,1.2858501944238876E-2]
{"$rows_left_out":171}
{"sheet":"Index, fondrörelsen","index":11,"n_rows":19,"n_cols":18,"rows_kept":19,"cut":false,"hidden":false,"merged":[]}
[]
[]
[]
[" "]
[null,"Värdeutveckling - fondrörelsen per kalenderår",null,null,null,null,null,null,"Nästa uppdatering: 2016-04-13"]
[]
[null,"Avkastningen i fondrörelsen mäter avkastningen på en genomsnittlig krona som sattes in i början på året. "]
[null,"Det kan jämföras med marknadsindex och enskilda fonders avkastning. "]
[null,"Rabatter på fondavgifter, myndighetens avgift och arvsvinster är inte medräknade."]
[]
[]
[]
[]
[null,"Värdeutveckling",2001,2002,2003,2004,2005,"2006-12-31",2007,2008,2009,2010,2011,2012,"2013-12-31","2014-12-31","2015-12-31","2016-02-29"]
[null,"I fondrörelsen1)",-0.111,-0.31223079839764201,0.1782730775091621,8.7501758829949594E-2,0.30552648011758543,0.12140116450721394,5.6636805614445285E-2,-0.34156819000074978,0.34685505788951732,0.12151293044644662,-0.10687426681227297,0.12125473461444458,0.21099999999999999,0.20699999999999999,6.4000000000000001E-2,-5.8935895875622868E-2]
[null,"I sjunde AP-fonden2)",-0.106,-0.26700000000000002,0.187,0.10100000000000001,0.251,0.105,4.7E-2,-0.36199999999999999,0.35141800246609134,0.14644453351666153,-0.10536246609942557,0.17497988455497548,0.318,0.29099999999999998,6.2E-2,-7.0177614251917708E-2]
[]
[null,"1) I beräkningen av värdeutvecklingen i fondrörelsen ingår alla fonder på fondtorget inklusive AP7 Aktiefond och AP7 Räntefond."]
[null,"2) I beräkningen av värdeutveckling för Sjunde AP-fondens förvaltning ingår AP7 Aktiefond och AP7 Räntefond."]

{"sheet":"Marknadsv. och tillfört kapital","index":12,"n_rows":17,"n_cols":19,"rows_kept":17,"cut":false,"hidden":false,"merged":[]}
[]
[]
[]
[]
[]
[null,"Marknadsvärde och tillfört kapital till fondrörelsen",null,null,null,null,null,null,null,"Nästa uppdatering: 2016-04-13"]
[]
[null,"Tillfört kapital är pengar från den tillfälliga förvaltningen (inklusive ränta) samt återförda fondavgifter och arvsvinster. "]
[null,"Från det tillförda kapitalet har det dragits av för pensionsutbetalningar, myndighetens avgift, samt överföringar till "]
[null,"traditionell försäkring. Jämförelsen mellan marknadsvärde och tillfört kapital ger alltså inte en fullständig bild av "]
[null,"utvecklingen av de inbetalda pensionsrätterna."]
[]
[]
[]
[null,null,2000,2001,2002,2003,2004,2005,"2006-12-31","2007-12-31","2008-01-01","2009-12-31","2010-12-31","2011-12-31","2012-12-31","2013-12-31","2014-12-31","2015-12-31","2016-02-29"]
[null,"Netto tillfört kapital, mdr",55.831616023629408,74.033547998326426,93.93715098490317,114.64956724755694,136.62021154457284,159.77779842054943,209,235.50159071018251,263.98657166722467,293.39683174242759,323.04324834873717,354.29697772737427,387,421,456,496,495]
[null,"Marknadsvärde, mdr",52.735199475111202,65.023593666597904,59.275358189472996,93.920076415257597,124.75628531142399,192.35696213467801,267,308.29568458589898,230.23493756186801,340.16227208294498,408.47751268748601,393.15689279941199,471,602,759,839,787]

{"sheet":"Avkastning sedan 2000","index":13,"n_rows":207,"n_cols":6,"rows_kept":207,"cut":false,"hidden":false,"merged":[[21,13,22,13],[21,14,22,14],[21,2,22,2],[21,3,22,3],[21,4,22,4],[21,5,22,5],[21,11,22,11],[21,12,22,12]]}
[]
[]
[]
[]
[null,"Värdeutveckling - fondrörelsen i genomsnitt per år"]
[]
[null,"Nästa uppdatering: 2016-04-13"]
[]
[]
[null,"Tidsviktad avkastning (TVA), mäter avkastningen på en genomsnittlig krona som sattes in i premiepensionssystemet 2000-12-13. "]
[null,"Premiepensionsindex kan jämföras med marknadsindex och enskilda fonders avkastning. Rabatten på fondavgiften,"]
[null," myndighetens avgift och arvsvinster är inte medräknade. "]
[]
[null,"Real avkastning = avkastning/inflation (KPI) "]
[null,"Med årsavkastningn menas genomsnittlig avkastning sedan start. "]
[]
[]
[]
[]
[]
[]
[null,"Datum","Tidsviktad årsavkastning (TVA)","Real tidsviktad årsavkastning (TVA)","Tidsviktad avkastning sedan start (TVA)","Real tidsviktad avkastning sedan start (TVA)"]
[]
[null,"2000-12-13",0,0,0]
[null,"2000-12-31",-4.5388155165690725E-2,-4.4660831855340755E-2,-4.5388155165690725E-2,-4.4660831855340755E-2]
[null,"2001-01-31",-2.3061835549637144E-2,-1.9328789449330031E-2,-2.3061835549637144E-2,-1.9328789449330031E-2]
[null,"2001-02-28",-9.3336214097018311E-2,-9.2990949898273945E-2,-9.3336214097018311E-2,-9.2990949898273945E-2]
[null,"2001-03-31",-0.15455948709528244,-0.16063029954622343,-0.15455948709528244,-0.16063029954622343]
[null,"2001-04-30",-0.10298425231858033,-0.1170998991535821,-0.10298425231858033,-0.1170998991535821]
[null,"2001-05-31",-7.016137882463358E-2,-9.0924429539379514E-2,-7.016137882463358E-2,-9.0924429539379514E-2]
[null,"2001-06-30",-9.557327690967421E-2,-0.11445061440242799,-9.557327690967421E-2,-0.11445061440242799]
[null,"2001-07-31",-0.13384481410068805,-0.14747483201292899,-0.13384481410068805,-0.14747483201292899]
[null,"2001-08-31",-0.18550338163818569,-0.20041755738546863,-0.18550338163818569,-0.20041755738546863]
[null,"2001-09-30",-0.25676123723683508,-0.27658828092670085,-0.25676123723683508,-0.27658828092670085]
[null,"2001-10-31",-0.21912568174453229,-0.23769720027606334,-0.21912568174453229,-0.23769720027606334]
[null,"2001-11-30",-0.16090624193691538,-0.18116667814571941,-0.16090624193691538,-0.18116667814571941]
[null,"2001-12-31",-0.15163030159442259,-0.17303629027404399,-0.15163030159442259,-0.17303629027404399]
[null,"2002-01-31",-0.16226125402914071,-0.17982548286273181,-0.18662022488362295,-0.20507862007785627]
[null,"2002-02-28",-0.15995282583486503,-0.17789240716081489,-0.19577125072951806,-0.21577248539957083]
[null,"2002-03-31",-0.13668758570700124,-0.1598893652815141,-0.17796435824374601,-0.20548652285000768]
{"$rows_left_out":168}
{"sheet":"Beskrivning av mått","index":14,"n_rows":21,"n_cols":3,"rows_kept":21,"cut":false,"hidden":false,"merged":[]}
[]
[]
[]
[]
[null,null,"Beskrivning av mått"]
[]
[]
[]
[]
[null,null,"Snitt 5 år:                        Geometriska medelvärdet av fondernas värdeutveckling i SEK för de senaste 60 månaderna (5 år)."]
[]
[null,null,"Risk:                               Standardavvikelse, 36 månader, anger hur kursutvecklingen avviker från medelvärdet."]
[]
[null,null,"Fondavgift, % netto:       TER minus myndighetens rabatt, pensionsspararens avgift till förvaltaren."]
[]
[null,null,"Fondavgift, % brutto:      Motsvarar TER. "]
[]
[null,null,"TER:                               (Total expence ratio) När myndighetens rabatt på fondavgiften beräknas används TER. I TER ingår fondens alla "]
[null,null,"                                       kostnader utom transaktionskostnader, kupongskatt, räntekostnader eller valutaförluster."]
[]
[null,null,"Sharpe-kvot:                   Ett mått på riskjusterad avkastning. Sharpe-kvot = (Värdeutvecklingen hos fonden - riskfria räntan) / Standardavvikelsen hos fonden (risk)."]

{"sheet":"Info Makro","index":15,"n_rows":27,"n_cols":2,"rows_kept":27,"cut":false,"hidden":false,"merged":[]}
[]
[]
[]
[]
[null,"För att kunna få tillgång till enkel sorteringsfunktionalitet i vissa blad behöver man aktivera makron."]
[null,"Detta görs genom att klicka på \"Aktivera makron\" när detta dokument öppnas (se nedan). "]
[null,"Har du valt att klicka på \"Inaktivera makron\" när detta dokument öppnades och vill kunna använda"]
[null,"sorteringsfunktionaliteten måste du stänga dokumentet och öppna på nytt med valet \"Aktivera makron\"."]
[]
[null,"Man kan även sortera manuellt om man inte vill utnyttja makrofunktionaliteten. Gå då direkt till"]
[null,"innehållsförteckningen genom att klicka på knappen här bredvid."]
[]
[]
[]
[]
[]
[]
[]
[]
[]
[]
[]
[]
[]
[null,"Kan du ändå inte sortera?"]
[null,"Då kan inställningarna till säkerhetsnivån för makron vara för hög på din dator. Ett alternativ"]
[null,"kan då vara att kontakta nätverksadministratören på din arbetsplats."]