{"text_format":"1","workbook":"xlsx","n_sheets":16,"sheets":["Innehåll","Fondval & marknadsvärde","10 mest valda fonder","Fondstatistik","Värdeutveckling - konto","Värdeutv. Premiepensionssystem","Värdeutv. fondrörelse per år","Marknadsv. & tillfört kapital","Värdeutveckling - fondrörelse","Värdeutv fondrörelse genomsnitt","Avkastning pp-systemet","Index, fondrörelsen","Marknadsv. och tillfört kapital","Avkastning sedan 2000","Beskrivning av mått","Info Makro"],"not_rendered":{"charts":5,"images":9,"macros":1,"external_links":0,"defined_names":22,"comments":0,"pivot_tables":0},"unopened":[],"bounds":{"document_bytes":16777216,"sheet_cells":100000,"rows_first":2000,"rows_last":500,"rows_between":2000,"halvings":0,"cell_chars":16384,"cell_head_chars":4096},"cells_cut":0,"cells_raw":0,"read":"whole","date_system":"1900"}

{"sheet":"Innehåll","index":0,"n_rows":25,"n_cols":2,"rows_kept":25,"cut":false,"hidden":false,"merged":[]}
[]
[]
[]
[]
[]
[]
[]
[null,"Månadsstatistik om premiepension"]
[]
[null,"INNEHÅLLSFÖRTECKNING"]
[null,"(klicka på resp rubrik för att komma till sidan)"]
[]
[null,"Fondval och aktuellt marknadsvärde"]
[null,"De tio mest valda fonderna m.m"]
[null,"Fondstatistik"]
[null,"Värdeutveckling - individuella konton"]
[null,"Värdeutveckling - pensionssystemet"]
[null,"Värdeutveckling för fondrörelsen per kalenderår"]
[null,"Marknadsvärde och tillfört kapital till fondrörelsen"]
[null,"Värdeutveckling för premiepensionsfondernas index"]
[null,"Värdeutveckling för fondrörelsen i genomsnitt per år"]
[null,""]
[null,"Beskrivning av mått"]
[]
[null,"Ordlista"]

{"sheet":"Fondval & marknadsvärde","index":1,"n_rows":869,"n_cols":13,"rows_kept":869,"cut":false,"hidden":false,"merged":[[20,2,20,4],[20,5,20,7]]}
[]
[]
[]
[]
[]
["Antal fondval och marknadsvärde i fonderna 2016-09-30",null,"Nästa uppdatering: 2016-11-08"]
[]
["Antal fondval, visar aktuellt läge vid månadsslut. "]
["Marknadsvärde = Fondandelar * Fondkurs * Valutakurs."]
["För att sortera tabellen så kan man klicka på resp rubrik och därefter på A-Ö eller Ö-A - knapparna i verktygsfältet ovan. Alternativt välj menyn Data och välj Sortera"]
["Klicka på resp rubrik för att sortera (stigande eller fallande)"]
[]
[]
[]
[]
[]
[]
[]
[null,null,null,null,null,null,null,"För att sortera innehållet på någon särskild variabel, placera dig på rubriken och klicka på!"]
[]
[null,null,"Antal fondval",null,null,"Marknadsvärde",null,null,"Svensk/ "]
["Fondkategori","Fondnamn","Kvinnor","Män","Total","Kvinnor","Män","Total","Utländsk","Fondtyp","Fondnr","Förvaltare"]
["Europa","AMF Aktiefond Europa",19660,25302,44962,682658169,1084463955,1767122124,"Svensk","Aktiefonder",538462,"AMF Fonder AB"]
["Övriga utländska","Aberdeen Global - Asia Local Currency Short Duration Bond Fund",350,530,880,11978689,23449180,35427869,"Utländsk","Räntefonder",336115,"Aberdeen International Fund Managers Ltd"]
["Nordamerika och USA","Aberdeen Global - North American Equity Fund",10203,9626,19829,267688078,323294419,590982497,"Utländsk","Aktiefonder",407775,"Aberdeen International Fund Managers Ltd"]
["Utländska aktier och räntor","BL - Emerging Markets",2367,4371,6738,66307699,151187997,217495696,"Utländsk","Blandfonder",153833,"Banque de Luxembourg S.A."]
["Nordamerika och USA småbolag","BlackRock Global Funds -  US Small & MidCap Opportunities Fund",560,936,1496,21430518,48617240,70047759,"Utländsk","Aktiefonder",625236,"BlackRock (Channel Islands) Ltd"]
["Nya marknader","Carnegie Emerging Markets",4210,5590,9800,121398657,197624896,319023554,"Svensk","Aktiefonder",285825,"Carnegie Fonder AB"]
["Asien och Fjärran östern","Carnegie Fund - WorldWide Asia Sub-fund",256,502,758,10805189,26418841,37224030,"Utländsk","Aktiefonder",379024,"Carnegie Fund Management Company S.A."]
["Svenska och utländska aktier samt svenska räntor","Danske Invest Horisont Försiktig",450,547,997,31242269,38263519,69505788,"Svensk","Blandfonder",963462,"Danske Capital AB"]
["Europa","Handelsbanken Europa Tema",7663,9589,17252,218180416,343437136,561617552,"Svensk","Aktiefonder",362020,"Handelsbanken Fonder AB"]
["Pension om mer än 20 år","Handelsbanken Pension 90 ",243,245,488,5576498,7760113,13336611,"Utländsk","Generationsfonder",337709,"Handelsbanken Funds"]
["Nordamerika och USA","Inside USA",299,687,986,13953603,37332447,51286050,"Svensk","Aktiefonder",297689,"Insiderfonder AB"]
["Pension om mindre än 20 år","SEB Generationsfond 60-tal",9082,7827,16909,870633633,880064729,1750698362,"Svensk","Generationsfonder",901017,"SEB Investment Management AB"]
["Övriga branscher","UBS (Lux) Equity Fund - Asian Consumption (USD)",176,268,444,5488006,10026785,15514791,"Utländsk","Aktiefonder",843698,"UBS Fund Management (Luxembourg) S.A"]
["Sverige lång","AMF Räntefond Lång",31341,30734,62075,1619409828,2057923219,3677333047,"Svensk","Räntefonder",574293,"AMF Fonder AB"]
["Japan","BlackRock Global Funds -  Japan Small & MidCap Opportunities Fund",435,595,1030,16784674,30121220,46905894,"Utländsk","Aktiefonder",159442,"BlackRock (Channel Islands) Ltd"]
["Nya marknader","Fidelity Funds - Emerging Markets Fund",1373,2048,3421,58851482,108615955,167467437,"Utländsk","Aktiefonder",978452,"FIL Investment Management (Luxembourg) S.A."]
["Övriga branscher","Gustavia Proxy Petroleum Energy",569,1280,1849,28127668,77902169,106029837,"Svensk","Aktiefonder",312850,"Isec Services AB"]
["Sverige kort","Handelsbanken Lux Korträntefond ",3457,2733,6190,145443169,157754693,303197862,"Utländsk","Räntefonder",718205,"Handelsbanken Funds"]
{"$rows_left_out":830}
{"sheet":"10 mest valda fonder","index":2,"n_rows":50,"n_cols":9,"rows_kept":50,"cut":false,"hidden":false,"merged":[[9,2,9,4],[9,5,9,7],[24,5,24,7],[24,2,24,4]]}
[]
[]
[]
[]
[null,"Fondstatistik per 2016-09-30","Nästa uppdatering: 2016-11-08"]
[]
[]
[]
[null,"De tio mest valda fonderna"]
[null,"Fondnamn","Antal fondval",null,null,"Marknadsvärde",null,null,"Värdeutveckling"]
[null,null,"Kvinnor","Män","Total","Kvinnor","Män","Total",2016]
[null,"AP7 Såfa - Statens årskullsförvaltningsalternativ",1667878,1787194,3455072,129230000000,162425000000,291654000000]
[null,"Swedbank Robur Technology",137484,145371,282855,6517656272,8772456467,15290112739,{"$f":"VLOOKUP($B$12:$B$21,Fondstatistik!$A$24:$R$1000,2,FALSE)","v":9}]
[null,"Didner & Gerge Aktiefond",112521,125076,237597,9077968818,12080501819,21158470637,{"$f":"VLOOKUP($B$12:$B$21,Fondstatistik!$A$24:$R$1000,2,FALSE)","v":8}]
[null,"AMF Aktiefond Sverige",114203,121544,235747,7688915495,10231318928,17920234423,{"$f":"VLOOKUP($B$12:$B$21,Fondstatistik!$A$24:$R$1000,2,FALSE)","v":3}]
[null,"AMF Aktiefond Världen",104461,107685,212146,6466231020,8439863311,14906094330,{"$f":"VLOOKUP($B$12:$B$21,Fondstatistik!$A$24:$R$1000,2,FALSE)","v":5}]
[null,"Swedbank Robur Aktiefond Pension",88781,76118,164899,5988430262,6242544512,12230974774,{"$f":"VLOOKUP($B$12:$B$21,Fondstatistik!$A$24:$R$1000,2,FALSE)","v":4}]
[null,"Swedbank Robur Transfer 80",64401,65165,129566,7956170829,9945199018,17901369846,{"$f":"VLOOKUP($B$12:$B$21,Fondstatistik!$A$24:$R$1000,2,FALSE)","v":4}]
[null,"Swedbank Robur Medica",63301,60041,123342,2539228192,3103093297,5642321489,{"$f":"VLOOKUP($B$12:$B$21,Fondstatistik!$A$24:$R$1000,2,FALSE)","v":-4}]
[null,"AMF Balansfond",63023,57402,120425,3711396720,4209162141,7920558860,{"$f":"VLOOKUP($B$12:$B$21,Fondstatistik!$A$24:$R$1000,2,FALSE)","v":5}]
[null,"Swedbank Robur Transfer 70",67103,51785,118888,8846347489,8075729007,16922076496,{"$f":"VLOOKUP($B$12:$B$21,Fondstatistik!$A$24:$R$1000,2,FALSE)","v":3}]
[]
[]
[null,"De tio fonderna med mest kapital"]
[null,"Fondnamn","Antal fondval",null,null,"Marknadsvärde",null,null,"Värdeutveckling"]
[null,null,"Kvinnor","Män","Total","Kvinnor","Män","Total",2016]
[null,"AP7 Såfa - Statens årskullsförvaltningsalternativ",1667878,1787194,3455072,129230000000,162425000000,291654000000]
[null,"Didner & Gerge Aktiefond",112521,125076,237597,9077968818,12080501819,21158470637,{"$f":"VLOOKUP($B$27:$B$36,Fondstatistik!$A$24:$R$1000,2,FALSE)","v":8}]
[null,"AMF Aktiefond Sverige",114203,121544,235747,7688915495,10231318928,17920234423,{"$f":"VLOOKUP($B$27:$B$36,Fondstatistik!$A$24:$R$1000,2,FALSE)","v":3}]
[null,"Swedbank Robur Transfer 80",64401,65165,129566,7956170829,9945199018,17901369846,{"$f":"VLOOKUP($B$27:$B$36,Fondstatistik!$A$24:$R$1000,2,FALSE)","v":4}]
[null,"Swedbank Robur Transfer 70",67103,51785,118888,8846347489,8075729007,16922076496,{"$f":"VLOOKUP($B$27:$B$36,Fondstatistik!$A$24:$R$1000,2,FALSE)","v":3}]
[null,"Swedbank Robur Technology",137484,145371,282855,6517656272,8772456467,15290112739,{"$f":"VLOOKUP($B$27:$B$36,Fondstatistik!$A$24:$R$1000,2,FALSE)","v":9}]
[null,"AMF Aktiefond Världen",104461,107685,212146,6466231020,8439863311,14906094330,{"$f":"VLOOKUP($B$27:$B$36,Fondstatistik!$A$24:$R$1000,2,FALSE)","v":5}]
[null,"Nordea Generationsfond 60-tal",43604,34396,78000,6448558660,5979461648,12428020308,{"$f":"VLOOKUP($B$27:$B$36,Fondstatistik!$A$24:$R$1000,2,FALSE)","v":5}]
[null,"Swedbank Robur Aktiefond Pension",88781,76118,164899,5988430262,6242544512,12230974774,{"$f":"VLOOKUP($B$27:$B$36,Fondstatistik!$A$24:$R$1000,2,FALSE)","v":4}]
[null,"Nordea Generationsfond 50-tal",41011,30069,71080,5820675777,4876923475,10697599252,{"$f":"VLOOKUP($B$27:$B$36,Fondstatistik!$A$24:$R$1000,2,FALSE)","v":3}]
[]
[]
[null,"De tio fonderna med högst värdeutveckling, snitt 5 år"]
[null,"Fondnamn",2016,"3 mån.","6 mån.","12 mån.","36 mån.","60 mån.","Snitt 5 år"]
{"$rows_left_out":11}
{"sheet":"Fondstatistik","index":3,"n_rows":870,"n_cols":19,"rows_kept":870,"cut":false,"hidden":false,"merged":[[19,1,19,7],[19,8,19,9]]}
[]
[]
[]
[]
["Fondstatistik per 2016-09-30","Nästa uppdatering: 2016-11-08"]
[]
["För att sortera tabellen, klicka på respektive rubrik och därefter på A-Ö eller Ö-A Knapparna i verktygsfältet ovan."]
["Alternativt välj menyn Data och välj Sortera"]
[]
["Klicka på resp rubrik för att sortera (stigande eller fallande)"]
[]
[]
[]
[]
[]
[]
[]
[null,null,null,null,null,null,null,null,null,null,null,null,null,null,null,null,"För att sortera innehållet på någon särskild variabel, placera dig på rubriken och klicka på!"]
[]
[null,"Värdeutveckling i SEK (%)",null,null,null,null,null,null,"Fondavgift (%)",null,null,"Sharpe-","Noterings-",null,"Svensk/"]
["Fondnamn","I år","3 mån.","6 mån.","12 mån.","36 mån.","60 mån.","Snitt 5 år","Netto","Brutto (TER)","Risk","kvot","valuta","Startdatum","Utländsk","Fondnummer","Förvaltare","Fondkategori","Etisk"]
["BL - Bond Euro",7,2,5,4,16,12,2.2999999999999998,0.28999999999999998,0.74,4.5,1.1000000000000001,"EUR",2000,"Utländsk",587634,"Banque de Luxembourg S.A.","Europa och Euroland"]
["BL - Global Bond",9,3,7,6,20,18,3.3,0.28999999999999998,0.73,4.3,1.4,"EUR",2000,"Utländsk",515973,"Banque de Luxembourg S.A.","Övriga utländska"]
["Ålandsbanken Euro Bond",8,4,7,6,22,29,5.2,0.28999999999999998,0.69,3.9,1.7,"EUR",2010,"Utländsk",203000,"Ålandsbanken Fondbolag Ab","Europa och Euroland"]
["Ålandsbanken Euro High Yield",11,5,9,8,26,60,9.9,0.39,1,4.8,1.6,"EUR",2010,"Utländsk",955435,"Ålandsbanken Fondbolag Ab","Europa och Euroland"]
["Ålandsbanken Europe Value",4,6,7,6,20,58,9.6,0.61,1.58,13.3,0.5,"EUR",2010,"Utländsk",238832,"Ålandsbanken Fondbolag Ab","Europa"]
["Öhman Obligationsfond",4,1,2,3,12,16,3,0.11,0.13,1.9,1.9,"SEK",2001,"Svensk",330746,"E. Öhman J:or Fonder AB","Sverige lång"]
["Spiltan Aktiefond Småland",10,16,15,28,85,210,25.4,0.55000000000000004,1.55,15.8,1.4,"SEK",2008,"Svensk",272898,"Spiltan Fonder AB","Sverige"]
["Spiltan Räntefond Sverige",2,1,2,2,6,13,2.4,0.1,0.1,0.6,3.2,"SEK",2008,"Svensk",972497,"Spiltan Fonder AB","Sverige kort"]
["Länsförsäkringar Kort Ränta Företag",0,0,0,0,null,null,null,0.13,0.3,null,null,"SEK",2014,"Svensk",838730,"Länsförsäkringar Fondförvaltning AB (publ)","Sverige kort","Fonden tar miljö och/eller etisk hänsyn"]
["Handelsbanken Asienfond",19,13,21,25,52,88,13.5,0.37,1.63,15.2,1,"SEK",2014,"Svensk",504100,"Handelsbanken Fonder AB","Asien och Fjärran östern"]
["Inside USA",11,0,11,16,74,null,null,0.89,5.16,13.7,1.4,"SEK",2012,"Svensk",297689,"Insiderfonder AB","Nordamerika och USA"]
["Invesco Emerging Market Quantitative Equity Fund",23,13,18,22,24,33,5.8,0.87,2.2200000000000002,15.6,0.5,"EUR",2012,"Utländsk",533919,"Invesco Management S.A","Nya marknader"]
["Inside Canada",28,6,18,25,46,null,null,0.89,4.93,14.6,0.9,"SEK",2012,"Svensk",261859,"Insiderfonder AB","Övriga länder"]
["BL - Emerging Markets",16,4,12,17,30,61,10,0.49,1.29,10.1,0.9,"EUR",2009,"Utländsk",153833,"Banque de Luxembourg S.A.","Utländska aktier och räntor"]
["BlackRock Global Funds -  European Value Fund",-2,6,4,0,33,105,15.5,0.61,1.83,13.3,0.8,"EUR",2004,"Utländsk",696898,"BlackRock (Channel Islands) Ltd","Europa"]
["BlackRock Global Funds -  Global Allocation Fund",6,6,10,9,44,65,10.6,0.52,1.78,10.199999999999999,1.3,"USD",2004,"Utländsk",302760,"BlackRock (Channel Islands) Ltd","Utländska aktier och räntor"]
["BlackRock Global Funds -  China Fund",15,17,23,24,77,118,16.899999999999999,0.61,1.84,21.2,1,"USD",2009,"Utländsk",391896,"BlackRock (Channel Islands) Ltd","Kina"]
["BlackRock Global Funds -  Japan Small & MidCap Opportunities Fund",11,6,16,20,45,83,12.8,0.61,1.84,14.8,0.9,"USD",2004,"Utländsk",159442,"BlackRock (Channel Islands) Ltd","Japan"]
["BlackRock Global Funds -  US Small & MidCap Opportunities Fund",6,8,14,11,66,132,18.3,0.61,1.83,14.9,1.2,"USD",2004,"Utländsk",625236,"BlackRock (Channel Islands) Ltd","Nordamerika och USA småbolag"]
{"$rows_left_out":831}
{"sheet":"Värdeutveckling - konto","index":4,"n_rows":45,"n_cols":3,"rows_kept":45,"cut":false,"hidden":false,"merged":[]}
[]
[]
[]
[]
[]
[]
[]
[null,null,"Nästa uppdatering: 2016-11-18"]
[]
[]
[]
[]
[]
[]
[]
[]
[]
[]
[]
[]
[]
[]
[]
[]
[]
[]
[]
[]
[]
[]
[]
[]
[]
[]
[]
[]
[]
[]
[]
[]
{"$rows_left_out":6}
{"sheet":"Värdeutv. Premiepensionssystem","index":5,"n_rows":70,"n_cols":7,"rows_kept":70,"cut":false,"hidden":false,"merged":[]}
[]
[]
[]
[]
[]
[null,null,null,null,null,null,"Nästa uppdatering: 2016-11-18"]
[]
[]
[]
[]
[]
[]
[]
[]
[]
[]
[]
[]
[]
[]
[]
[]
[]
[]
[]
[]
[]
[]
[]
[]
[]
[]
[]
[]
[]
[]
[]
[]
[]
[]
{"$rows_left_out":31}
{"sheet":"Värdeutv. fondrörelse per år","index":6,"n_rows":49,"n_cols":7,"rows_kept":49,"cut":false,"hidden":false,"merged":[]}
[]
[]
[]
[]
[null,null,null,null,null,null,"Nästa uppdatering: 2016-11-18"]
[]
[]
[]
[]
[]
[]
[]
[]
[]
[]
[]
[]
[]
[]
[]
[]
[]
[]
[]
[]
[]
[]
[]
[]
[]
[]
[]
[]
[]
[]
[]
[]
[]
[]
[]
{"$rows_left_out":10}
{"sheet":"Marknadsv. & tillfört kapital","index":7,"n_rows":44,"n_cols":7,"rows_kept":44,"cut":false,"hidden":false,"merged":[]}
[]
[]
[]
[]
[]
[]
[null,null,null,null,null,null,"Nästa uppdatering: 2016-11-18"]
[]
[]
[]
[]
[]
[]
[]
[]
[]
[]
[]
[]
[]
[]
[]
[]
[]
[]
[]
[]
[]
[]
[]
[]
[]
[]
[]
[]
[]
[]
[]
[]
[]
{"$rows_left_out":5}
{"sheet":"Värdeutveckling - fondrörelse","index":8,"n_rows":46,"n_cols":7,"rows_kept":46,"cut":false,"hidden":false,"merged":[]}
[]
[]
[]
[]
[]
[null,null,null,null,null,null,"Nästa uppdatering: 2016-11-18"]
[]
[]
[]
[]
[]
[]
[]
[]
[]
[]
[]
[]
[]
[]
[]
[]
[]
[]
[]
[]
[]
[]
[]
[]
[]
[]
[]
[]
[]
[]
[]
[]
[]
[]
{"$rows_left_out":7}
{"sheet":"Värdeutv fondrörelse genomsnitt","index":9,"n_rows":47,"n_cols":7,"rows_kept":47,"cut":false,"hidden":false,"merged":[]}
[]
[]
[]
[]
[]
[null,null,null,null,null,null,"Nästa uppdatering: 2016-11-18"]
[]
[]
[]
[]
[]
[]
[]
[]
[]
[]
[]
[]
[]
[]
[]
[]
[]
[]
[]
[]
[]
[]
[]
[]
[]
[]
[]
[]
[]
[]
[]
[]
[]
[]
{"$rows_left_out":8}
{"sheet":"Avkastning pp-systemet","index":10,"n_rows":217,"n_cols":6,"rows_kept":217,"cut":false,"hidden":false,"merged":[[24,2,25,2],[24,3,25,3],[24,4,25,4],[24,5,25,5]]}
[]
[]
[]
[]
[null,"Värdeutveckling - Premiepensionssystemet",null,null,null,"Nästa uppdatering 2016-11-18"]
[]
[null,"Siffrorna omfattar både avkastningen i fondrörelsen och avkastningen av pengarna fram till tidpunkten då de placerades i fonderna."]
[null,"Kapitalviktad avkastning anger genomsnittlig årlig utveckling för en genomsnittlig persons premiepensionskonto. "]
[null,"Måttet kan jämföras med räntan på ett bankkonto."]
[null,"Den kapitalviktade avkastningen kan inte jämföras med marknadsindex eller med enskilda fonders avkastning. "]
[null,"Balansindex är den siffra med vilken inkomstpensionen räknas upp årligen och är jämförbar med den kapitalviktade årsavkastningen."]
[]
[null,"I tabellen nedan kan man därför jämföra den genomsnittlige personens avkastning i premiepensionssystemet "]
[null,"med personens avkastning i inkomstpensionen. "]
[]
[null,"Med årsavkastning avses genomsnittlig årsavkastning sedan start."]
[]
[]
[]
[]
[]
[]
[]
[]
[null,"Datum","Kapitalviktad \nårsavkastning (IR)","Real kapitalviktad årsavkastning (IR)","Balansindex, (IR)","Balansindex, realt (IR) *"]
[]
[null,"2000-12-13",4.1944485443448101E-2,3.4185081486749702E-2]
[null,"2000-12-31",2.9172234535217278E-2,2.1548629423359555E-2,2.2797217369079588E-2,1.4385435572878524E-2]
[null,"2001-01-31",3.4470444993645266E-2,2.7404682439887473E-2]
[null,"2001-02-28",1.5265800868734553E-2,7.8503517895816E-3]
[null,"2001-03-31",-1.8410568162869163E-3,-1.0267239300616793E-2]
[null,"2001-04-30",2.0691238008785837E-2,1.0771200659497771E-2]
[null,"2001-05-31",2.985371110015975E-2,1.8881108471976438E-2]
[null,"2001-06-30",2.1832256757043877E-2,1.1325475944840457E-2]
[null,"2001-07-31",9.9048701493387632E-3,4.7028351006228597E-4]
[null,"2001-08-31",-5.8520358709966656E-3,-1.5417734422042306E-2]
[null,"2001-09-30",-2.8352978395008131E-2,-3.8834699205131495E-2]
[null,"2001-10-31",-1.585379730917981E-2,-2.5904718303681462E-2]
[null,"2001-11-30",1.5011297694889443E-3,-8.6559676423678678E-3]
[null,"2001-12-31",4.0387541055679332E-3,-6.1731336402864878E-3,2.3982968330383304E-2,1.2858501944238876E-2]
{"$rows_left_out":178}
{"sheet":"Index, fondrörelsen","index":11,"n_rows":19,"n_cols":18,"rows_kept":19,"cut":false,"hidden":false,"merged":[]}
[]
[]
[]
[" "]
[null,"Värdeutveckling - fondrörelsen per kalenderår",null,null,null,null,null,null,"Nästa uppdatering: 2016-11-18"]
[]
[null,"Avkastningen i fondrörelsen mäter avkastningen på en genomsnittlig krona som sattes in i början på året. "]
[null,"Det kan jämföras med marknadsindex och enskilda fonders avkastning. "]
[null,"Rabatter på fondavgifter, myndighetens avgift och arvsvinster är inte medräknade."]
[]
[]
[]
[]
[null,"Värdeutveckling",2001,2002,2003,2004,2005,"2006-12-31",2007,2008,2009,2010,2011,2012,"2013-12-31","2014-12-31","2015-12-31","2016-09-30"]
[null,"I fondrörelsen1)",-0.111,-0.31223079839764201,0.1782730775091621,8.7501758829949594E-2,0.30552648011758543,0.12140116450721394,5.6636805614445285E-2,-0.34156819000074978,0.34685505788951732,0.12151293044644662,-0.10687426681227297,0.12125473461444458,0.21099999999999999,0.20699999999999999,6.4000000000000001E-2,5.7000000000000002E-2]
[null,"I sjunde AP-fonden2)",-0.106,-0.26700000000000002,0.187,0.10100000000000001,0.251,0.105,4.7E-2,-0.36199999999999999,0.35141800246609134,0.14644453351666153,-0.10536246609942557,0.17497988455497548,0.318,0.29099999999999998,6.2E-2,7.5999999999999998E-2]
[]
[null,"1) I beräkningen av värdeutvecklingen i fondrörelsen ingår alla fonder på fondtorget inklusive AP7 Aktiefond och AP7 Räntefond."]
[null,"2) I beräkningen av värdeutveckling för Sjunde AP-fondens förvaltning ingår AP7 Aktiefond och AP7 Räntefond."]

{"sheet":"Marknadsv. och tillfört kapital","index":12,"n_rows":17,"n_cols":19,"rows_kept":17,"cut":false,"hidden":false,"merged":[]}
[]
[]
[]
[]
[]
[null,"Marknadsvärde och tillfört kapital till fondrörelsen",null,null,null,null,null,null,null,"Nästa uppdatering: 2016-11-18"]
[]
[null,"Tillfört kapital är pengar från den tillfälliga förvaltningen (inklusive ränta) samt återförda fondavgifter och arvsvinster. "]
[null,"Från det tillförda kapitalet har det dragits av för pensionsutbetalningar, myndighetens avgift, samt överföringar till "]
[null,"traditionell försäkring. Jämförelsen mellan marknadsvärde och tillfört kapital ger alltså inte en fullständig bild av "]
[null,"utvecklingen av de inbetalda pensionsrätterna."]
[]
[]
[]
[null,"Fondrörelsen",2000,2001,2002,2003,2004,2005,"2006-12-31","2007-12-31","2008-01-01","2009-12-31","2010-12-31","2011-12-31","2012-12-31","2013-12-31","2014-12-31","2015-12-31","2016-09-30"]
[null,"Netto tillfört kapital, mdr",55.831616023629408,74.033547998326426,93.93715098490317,114.64956724755694,136.62021154457284,159.77779842054943,209,235.50159071018251,263.98657166722467,293.39683174242759,323.04324834873717,354.29697772737427,387,421,456,496,502]
[null,"Marknadsvärde, mdr",52.735199475111202,65.023593666597904,59.275358189472996,93.920076415257597,124.75628531142399,192.35696213467801,267,308.29568458589898,230.23493756186801,340.16227208294498,408.47751268748601,393.15689279941199,471,602,759,839,884]

{"sheet":"Avkastning sedan 2000","index":13,"n_rows":214,"n_cols":6,"rows_kept":214,"cut":false,"hidden":false,"merged":[[21,13,22,13],[21,14,22,14],[21,2,22,2],[21,3,22,3],[21,4,22,4],[21,5,22,5],[21,11,22,11],[21,12,22,12]]}
[]
[]
[]
[]
[null,"Värdeutveckling - fondrörelsen i genomsnitt per år"]
[]
[null,"Nästa uppdatering: 2016-11-18"]
[]
[]
[null,"Tidsviktad avkastning (TVA), mäter avkastningen på en genomsnittlig krona som sattes in i premiepensionssystemet 2000-12-13. "]
[null,"Premiepensionsindex kan jämföras med marknadsindex och enskilda fonders avkastning. Rabatten på fondavgiften,"]
[null," myndighetens avgift och arvsvinster är inte medräknade. "]
[]
[null,"Real avkastning = avkastning/inflation (KPI) "]
[null,"Med årsavkastningn menas genomsnittlig avkastning sedan start. "]
[]
[]
[]
[]
[]
[]
[null,"Datum","Tidsviktad årsavkastning (TVA)","Real tidsviktad årsavkastning (TVA)","Tidsviktad avkastning sedan start (TVA)","Real tidsviktad avkastning sedan start (TVA)"]
[]
[null,"2000-12-13",0,0,0]
[null,"2000-12-31",-4.5388155165690725E-2,-4.4660831855340755E-2,-4.5388155165690725E-2,-4.4660831855340755E-2]
[null,"2001-01-31",-2.3061835549637144E-2,-1.9328789449330031E-2,-2.3061835549637144E-2,-1.9328789449330031E-2]
[null,"2001-02-28",-9.3336214097018311E-2,-9.2990949898273945E-2,-9.3336214097018311E-2,-9.2990949898273945E-2]
[null,"2001-03-31",-0.15455948709528244,-0.16063029954622343,-0.15455948709528244,-0.16063029954622343]
[null,"2001-04-30",-0.10298425231858033,-0.1170998991535821,-0.10298425231858033,-0.1170998991535821]
[null,"2001-05-31",-7.016137882463358E-2,-9.0924429539379514E-2,-7.016137882463358E-2,-9.0924429539379514E-2]
[null,"2001-06-30",-9.557327690967421E-2,-0.11445061440242799,-9.557327690967421E-2,-0.11445061440242799]
[null,"2001-07-31",-0.13384481410068805,-0.14747483201292899,-0.13384481410068805,-0.14747483201292899]
[null,"2001-08-31",-0.18550338163818569,-0.20041755738546863,-0.18550338163818569,-0.20041755738546863]
[null,"2001-09-30",-0.25676123723683508,-0.27658828092670085,-0.25676123723683508,-0.27658828092670085]
[null,"2001-10-31",-0.21912568174453229,-0.23769720027606334,-0.21912568174453229,-0.23769720027606334]
[null,"2001-11-30",-0.16090624193691538,-0.18116667814571941,-0.16090624193691538,-0.18116667814571941]
[null,"2001-12-31",-0.15163030159442259,-0.17303629027404399,-0.15163030159442259,-0.17303629027404399]
[null,"2002-01-31",-0.16226125402914071,-0.17982548286273181,-0.18662022488362295,-0.20507862007785627]
[null,"2002-02-28",-0.15995282583486503,-0.17789240716081489,-0.19577125072951806,-0.21577248539957083]
[null,"2002-03-31",-0.13668758570700124,-0.1598893652815141,-0.17796435824374601,-0.20548652285000768]
{"$rows_left_out":175}
{"sheet":"Beskrivning av mått","index":14,"n_rows":21,"n_cols":3,"rows_kept":21,"cut":false,"hidden":false,"merged":[]}
[]
[]
[]
[]
[null,null,"Beskrivning av mått"]
[]
[]
[]
[]
[null,null,"Snitt 5 år:                        Geometriska medelvärdet av fondernas värdeutveckling i SEK för de senaste 60 månaderna (5 år)."]
[]
[null,null,"Risk:                               Standardavvikelse, 36 månader, anger hur kursutvecklingen avviker från medelvärdet."]
[]
[null,null,"Fondavgift, % netto:       TER minus myndighetens rabatt, pensionsspararens avgift till förvaltaren."]
[]
[null,null,"Fondavgift, % brutto:      Motsvarar TER. "]
[]
[null,null,"TER:                               (Total expence ratio) När myndighetens rabatt på fondavgiften beräknas används TER. I TER ingår fondens alla "]
[null,null,"                                       kostnader utom transaktionskostnader, kupongskatt, räntekostnader eller valutaförluster."]
[]
[null,null,"Sharpe-kvot:                   Ett mått på riskjusterad avkastning. Sharpe-kvot = (Värdeutvecklingen hos fonden - riskfria räntan) / Standardavvikelsen hos fonden (risk)."]

{"sheet":"Info Makro","index":15,"n_rows":27,"n_cols":2,"rows_kept":27,"cut":false,"hidden":false,"merged":[]}
[]
[]
[]
[]
[null,"För att kunna få tillgång till enkel sorteringsfunktionalitet i vissa blad behöver man aktivera makron."]
[null,"Detta görs genom att klicka på \"Aktivera makron\" när detta dokument öppnas (se nedan). "]
[null,"Har du valt att klicka på \"Inaktivera makron\" när detta dokument öppnades och vill kunna använda"]
[null,"sorteringsfunktionaliteten måste du stänga dokumentet och öppna på nytt med valet \"Aktivera makron\"."]
[]
[null,"Man kan även sortera manuellt om man inte vill utnyttja makrofunktionaliteten. Gå då direkt till"]
[null,"innehållsförteckningen genom att klicka på knappen här bredvid."]
[]
[]
[]
[]
[]
[]
[]
[]
[]
[]
[]
[]
[]
[null,"Kan du ändå inte sortera?"]
[null,"Då kan inställningarna till säkerhetsnivån för makron vara för hög på din dator. Ett alternativ"]
[null,"kan då vara att kontakta nätverksadministratören på din arbetsplats."]