{"text_format":"1","workbook":"xlsx","n_sheets":16,"sheets":["Innehåll","Fondval & marknadsvärde","10 mest valda fonder","Fondstatistik","Värdeutveckling - konto","Värdeutv. Premiepensionssystem","Värdeutv. fondrörelse per år","Marknadsv. & tillfört kapital","Värdeutveckling - fondrörelse","Värdeutv fondrörelse genomsnitt","Avkastning pp-systemet","Index, fondrörelsen","Marknadsv. och tillfört kapital","Avkastning sedan 2000","Beskrivning av mått","Info Makro"],"not_rendered":{"charts":6,"images":8,"macros":1,"external_links":1,"defined_names":22,"comments":0,"pivot_tables":0},"unopened":[],"bounds":{"document_bytes":16777216,"sheet_cells":100000,"rows_first":2000,"rows_last":500,"rows_between":2000,"halvings":0,"cell_chars":16384,"cell_head_chars":4096},"cells_cut":0,"cells_raw":0,"read":"whole","date_system":"1900"}

{"sheet":"Innehåll","index":0,"n_rows":23,"n_cols":2,"rows_kept":23,"cut":false,"hidden":false,"merged":[]}
[]
[]
[]
[]
[]
[]
[]
[null,"Månadsstatistik om premiepension"]
[]
[null,"INNEHÅLLSFÖRTECKNING"]
[null,"(klicka på resp rubrik för att komma till sidan)"]
[]
[null,"Fondval och aktuellt marknadsvärde"]
[null,"De tio mest valda fonderna m.m"]
[null,"Fondstatistik"]
[null,"Värdeutveckling - individuella konton"]
[null,"Värdeutveckling - pensionssystemet"]
[null,"Värdeutveckling för fondrörelsen per kalenderår"]
[null,"Marknadsvärde och tillfört kapital till fondrörelsen"]
[null,"Värdeutveckling för premiepensionsfondernas index"]
[null,"Värdeutveckling för fondrörelsen i genomsnitt per år"]
[null,""]
[null,"Beskrivning av mått"]

{"sheet":"Fondval & marknadsvärde","index":1,"n_rows":878,"n_cols":13,"rows_kept":878,"cut":false,"hidden":false,"merged":[[20,2,20,4],[20,5,20,7]]}
[]
[]
[]
[]
[]
["Antal fondval och marknadsvärde i fonderna 2017-08-31",null,"Nästa uppdatering: 2017-10-06"]
[]
["Antal fondval, visar aktuellt läge vid månadsslut. "]
["Marknadsvärde = Fondandelar * Fondkurs * Valutakurs."]
["För att sortera tabellen så kan man klicka på resp rubrik och därefter på A-Ö eller Ö-A - knapparna i verktygsfältet ovan. Alternativt välj menyn Data och välj Sortera"]
["Klicka på resp rubrik för att sortera (stigande eller fallande)"]
[]
[]
[]
[]
[]
[]
["*"]
["**"]
[]
[null,null,"Antal fondval",null,null,"Marknadsvärde",null,null,"Svensk/ "]
["Fondkategori","Fondnamn","Kvinnor","Män","Total","Kvinnor","Män","Total","Utländsk","Fondtyp","Fondnr","Förvaltare"]
["Statens förvaltningsalternativ","AP7 Såfa - Statens årskullsförvaltningsalternativ",1773477,1900927,3674404,153969553914,192023399523,345992953437,"Svensk","Generationsfonder",1,"Sjunde AP-fonden"]
["IT och kommunikation","Swedbank Robur Technology",138180,148454,286634,8131549001,11097705018,19229254019,"Svensk","Aktiefonder",283408,"Swedbank Robur Fonder AB"]
["Sverige","Didner & Gerge Aktiefond",112453,125385,237838,10349240719,13764549418,24113790136,"Svensk","Aktiefonder",291906,"Didner & Gerge Fonder AB"]
["Sverige","AMF Aktiefond Sverige",110950,117557,228507,8412709132,11138974015,19551683146,"Svensk","Aktiefonder",681783,"AMF Fonder AB"]
["Global och Sverige","AMF Aktiefond Världen",101968,104808,206776,7039397152,9135949300,16175346452,"Svensk","Aktiefonder",645952,"AMF Fonder AB"]
["Global och Sverige","Swedbank Robur Aktiefond Pension",86641,74398,161039,6713204570,6995656141,13708860711,"Svensk","Aktiefonder",785022,"Swedbank Robur Fonder AB"]
["Pension om mer än 10 år","Swedbank Robur Transfer 80",64295,64463,128758,8816684634,10896211690,19712896324,"Svensk","Generationsfonder",747899,"Swedbank Robur Fonder AB"]
["Pension om mer än 10 år","Swedbank Robur Transfer 70",66384,51170,117554,9523484483,8653117642,18176602125,"Svensk","Generationsfonder",783720,"Swedbank Robur Fonder AB"]
["Varierande","AMF Balansfond",61278,55489,116767,3887016104,4394581960,8281598064,"Svensk","Blandfonder",610121,"AMF Fonder AB"]
["Läkemedel och bioteknik","Swedbank Robur Medica",60266,56423,116689,2377678028,2857420617,5235098644,"Svensk","Aktiefonder",928341,"Swedbank Robur Fonder AB"]
["Sverige","Swedbank Robur Sverigefond MEGA",52335,49357,101692,3151017541,3638422723,6789440263,"Svensk","Aktiefonder",789271,"Swedbank Robur Fonder AB"]
["Global","AP7 Aktiefond",39742,57070,96812,4001037334,6281717304,10282754639,"Svensk","Aktiefonder",581371,"Sjunde AP-Fonden"]
["Pension om mer än 10 år","SPP Generation 60-tal",53253,42719,95972,5267972117,5114988014,10382960131,"Svensk","Generationsfonder",463141,"SPP Fonder AB"]
["Sverige","SPP Aktiefond Sverige",42703,45908,88611,2638413336,3486703746,6125117082,"Svensk","Aktiefonder",212332,"SPP Fonder AB"]
["Sverige","Avanza Zero - Fonden utan avgifter",32705,55782,88487,2088145096,4196953950,6285099046,"Svensk","Aktiefonder",734491,"Avanza Fonder AB"]
["Global","Swedbank Robur Globalfond MEGA",44906,40604,85510,2583309673,3111036627,5694346300,"Svensk","Aktiefonder",753442,"Swedbank Robur Fonder AB"]
["Läkemedel och bioteknik","C WorldWide Medical",43361,39630,82991,1892567315,2059876343,3952443658,"Utländsk","Aktiefonder",313155,"C WorldWide Fund Management S.A."]
["Fastighet","Länsförsäkringar Fastighetsfond",37961,43512,81473,2119764999,2998663561,5118428559,"Svensk","Aktiefonder",313742,"Länsförsäkringar Fondförvaltning AB (publ)"]
{"$rows_left_out":839}
{"sheet":"10 mest valda fonder","index":2,"n_rows":50,"n_cols":9,"rows_kept":50,"cut":false,"hidden":false,"merged":[[9,2,9,4],[9,5,9,7],[24,5,24,7],[24,2,24,4]]}
[]
[]
[]
[]
[null,"Fondstatistik per 2017-08-31","Nästa uppdatering: 2017-10-06"]
[]
[]
[]
[null,"De tio mest valda fonderna"]
[null,"Fondnamn","Antal fondval",null,null,"Marknadsvärde",null,null,"Värdeutveckling"]
[null,null,"Kvinnor","Män","Total","Kvinnor","Män","Total",2017]
[null,"AP7 Såfa - Statens årskullsförvaltningsalternativ",1773477,1900927,3674404,153969553914,192023399523,345992953437]
[null,"Swedbank Robur Technology",138180,148454,286634,8131549001,11097705018,19229254019,{"$f":"VLOOKUP($B$12:$B$21,Fondstatistik!$B$24:$S$998,2,FALSE)","v":16}]
[null,"Didner & Gerge Aktiefond",112453,125385,237838,10349240719,13764549418,24113790136,{"$f":"VLOOKUP($B$12:$B$21,Fondstatistik!$B$24:$S$998,2,FALSE)","v":6}]
[null,"AMF Aktiefond Sverige",110950,117557,228507,8412709132,11138974015,19551683146,{"$f":"VLOOKUP($B$12:$B$21,Fondstatistik!$B$24:$S$998,2,FALSE)","v":6}]
[null,"AMF Aktiefond Världen",101968,104808,206776,7039397152,9135949300,16175346452,{"$f":"VLOOKUP($B$12:$B$21,Fondstatistik!$B$24:$S$998,2,FALSE)","v":3}]
[null,"Swedbank Robur Aktiefond Pension",86641,74398,161039,6713204570,6995656141,13708860711,{"$f":"VLOOKUP($B$12:$B$21,Fondstatistik!$B$24:$S$998,2,FALSE)","v":5}]
[null,"Swedbank Robur Transfer 80",64295,64463,128758,8816684634,10896211690,19712896324,{"$f":"VLOOKUP($B$12:$B$21,Fondstatistik!$B$24:$S$998,2,FALSE)","v":1}]
[null,"Swedbank Robur Transfer 70",66384,51170,117554,9523484483,8653117642,18176602125,{"$f":"VLOOKUP($B$12:$B$21,Fondstatistik!$B$24:$S$998,2,FALSE)","v":0}]
[null,"AMF Balansfond",61278,55489,116767,3887016104,4394581960,8281598064,{"$f":"VLOOKUP($B$12:$B$21,Fondstatistik!$B$24:$S$998,2,FALSE)","v":2}]
[null,"Swedbank Robur Medica",60266,56423,116689,2377678028,2857420617,5235098644,{"$f":"VLOOKUP($B$12:$B$21,Fondstatistik!$B$24:$S$998,2,FALSE)","v":-3}]
[]
[]
[null,"De tio fonderna med mest kapital"]
[null,"Fondnamn","Antal fondval",null,null,"Marknadsvärde",null,null,"Värdeutveckling"]
[null,null,"Kvinnor","Män","Total","Kvinnor","Män","Total",2017]
[null,"AP7 Såfa - Statens årskullsförvaltningsalternativ",1773477,1900927,3674404,153969553914,192023399523,345992953437]
[null,"Didner & Gerge Aktiefond",112453,125385,237838,10349240719,13764549418,24113790136,{"$f":"VLOOKUP($B$28:$B$36,Fondstatistik!$B$24:$S$998,2,FALSE)","v":6}]
[null,"Swedbank Robur Transfer 80",64295,64463,128758,8816684634,10896211690,19712896324,{"$f":"VLOOKUP($B$28:$B$36,Fondstatistik!$B$24:$S$998,2,FALSE)","v":1}]
[null,"AMF Aktiefond Sverige",110950,117557,228507,8412709132,11138974015,19551683146,{"$f":"VLOOKUP($B$28:$B$36,Fondstatistik!$B$24:$S$998,2,FALSE)","v":6}]
[null,"Swedbank Robur Technology",138180,148454,286634,8131549001,11097705018,19229254019,{"$f":"VLOOKUP($B$28:$B$36,Fondstatistik!$B$24:$S$998,2,FALSE)","v":16}]
[null,"Swedbank Robur Transfer 70",66384,51170,117554,9523484483,8653117642,18176602125,{"$f":"VLOOKUP($B$28:$B$36,Fondstatistik!$B$24:$S$998,2,FALSE)","v":0}]
[null,"AMF Aktiefond Världen",101968,104808,206776,7039397152,9135949300,16175346452,{"$f":"VLOOKUP($B$28:$B$36,Fondstatistik!$B$24:$S$998,2,FALSE)","v":3}]
[null,"Nordea Generationsfond 60-tal",44761,35510,80271,7625460948,7119087273,14744548221,{"$f":"VLOOKUP($B$28:$B$36,Fondstatistik!$B$24:$S$998,2,FALSE)","v":3}]
[null,"Swedbank Robur Aktiefond Pension",86641,74398,161039,6713204570,6995656141,13708860711,{"$f":"VLOOKUP($B$28:$B$36,Fondstatistik!$B$24:$S$998,2,FALSE)","v":5}]
[null,"Nordea Generationsfond 70-tal",42529,35216,77745,6149166841,5983225919,12132392760,{"$f":"VLOOKUP($B$28:$B$36,Fondstatistik!$B$24:$S$998,2,FALSE)","v":3}]
[]
[]
[null,"De tio fonderna med högst värdeutveckling, snitt 5 år"]
[null,"Fondnamn",2017,"3 mån.","6 mån.","12 mån.","36 mån.","60 mån.","Snitt 5 år"]
{"$rows_left_out":11}
{"sheet":"Fondstatistik","index":3,"n_rows":886,"n_cols":20,"rows_kept":886,"cut":false,"hidden":false,"merged":[[19,2,19,8],[19,9,19,10]]}
[]
[]
[]
[]
[null,"Fondstatistik per 2017-08-31","Nästa uppdatering: 2017-10-06"]
[]
[null,"För att sortera tabellen, klicka på respektive rubrik och därefter på A-Ö eller Ö-A Knapparna i verktygsfältet ovan."]
[null,"Alternativt välj menyn Data och välj Sortera"]
[]
[null,"Klicka på resp rubrik för att sortera (stigande eller fallande)"]
[]
[]
[]
[]
[]
[]
[null,"*"]
[null,"**",null,null,null,null,null,null,null,null,null,null,null,null,null,null,null,"För att sortera innehållet på någon särskild variabel, placera dig på rubriken och klicka på!"]
[]
[null,null,"Värdeutveckling i SEK (%)",null,null,null,null,null,null,"Fondavgift (%)",null,null,"Sharpe-","Noterings-",null,"Svensk/"]
[null,"Fondnamn","I år","3 mån.","6 mån.","12 mån.","36 mån.","60 mån.","Snitt 5 år","Netto","Brutto (TER)","Risk","kvot","valuta","Startdatum","Utländsk","Fondnummer","Förvaltare","Fondkategori","Etisk"]
[null,"Swedbank Robur Penningmarknadsfond",0,0,0,0,0,2,0.4,0,0,0.1,1.8,"SEK",2000,"Svensk",717611,"Swedbank Robur Fonder AB","Sverige kortränta","Fonden tar miljö och/eller etisk hänsyn"]
[null,"Avanza Zero - Fonden utan avgifter",5,-6,2,13,24,78,12.2,0,0,12.8,0.6,"SEK",2006,"Svensk",734491,"Avanza Fonder AB","Sverige"]
[null,"Allra Strategi Försiktig",0,-3,-2,1,4,17,3.3,0,1.6,5,0.3,"SEK",2011,"Utländsk",322008,"Allra Asset Management S.A.","Balanserad","Fonden tar miljö och/eller etisk hänsyn"]
[null,"Handelsbanken Pension 40",2,-1,1,3,10,27,5,0.01,0.01,3.4,1,"SEK",2012,"Utländsk",167114,"Handelsbanken Funds","Pension om mindre än 10 år"]
[null,"Handelsbanken Pension 50",3,-2,1,7,21,55,9.1999999999999993,0.01,0.01,7.6,0.9,"SEK",2012,"Utländsk",314682,"Handelsbanken Funds","Pension om mindre än 10 år"]
[null,"Handelsbanken Pension 80",5,-5,1,12,32,85,13.1,0.01,0.01,12,0.8,"SEK",2012,"Utländsk",243022,"Handelsbanken Funds","Pension om mer än 10 år"]
[null,"Handelsbanken Pension 70",5,-5,1,12,32,85,13,0.01,0.01,12,0.8,"SEK",2012,"Utländsk",278853,"Handelsbanken Funds","Pension om mer än 10 år"]
[null,"Handelsbanken Pension 60",5,-4,1,11,30,83,12.8,0.01,0.01,11.9,0.8,"SEK",2012,"Utländsk",350512,"Handelsbanken Funds","Pension om mer än 10 år"]
[null,"Handelsbanken Pension 90",5,-5,1,12,null,null,null,0.01,0.01,null,null,"SEK",2015,"Utländsk",337709,"Handelsbanken Funds","Pension om mer än 10 år"]
[null,"AP7 Räntefond",0,0,0,0,2,7,1.4,0.04,0.04,0.5,1.6,"SEK",2010,"Svensk",545541,"Sjunde AP-Fonden","Sverige lång och realränta","Fonden tar miljö och/eller etisk hänsyn"]
[null,"Spiltan Räntefond Sverige",1,0,1,2,5,11,2.2000000000000002,0.1,0.1,0.6,3.2,"SEK",2008,"Svensk",972497,"Spiltan Fonder AB","Sverige kortränta"]
[null,"AMF Räntefond Lång",1,0,0,0,6,14,2.7,0.1,0.1,2.1,1.1000000000000001,"SEK",2000,"Svensk",574293,"AMF Fonder AB","Sverige lång och realränta"]
[null,"AMF Räntefond kort",0,0,0,0,0,4,0.8,0.1,0.1,0.3,0.7,"SEK",2004,"Svensk",305185,"AMF Fonder AB","Sverige kortränta"]
[null,"KPA Etisk Räntefond",0,0,0,0,0,2,0.3,0.1,0.11,0.1,0.4,"SEK",2000,"Svensk",188664,"Swedbank Robur Fonder AB","Sverige kortränta","Fonden tar miljö och/eller etisk hänsyn"]
[null,"Öhman Penningmarknadsfond",0,0,0,-1,-1,0,0,0.1,0.11,0.1,-3.6,"SEK",2001,"Svensk",294918,"E. Öhman J:or Fonder AB","Sverige kortränta","Fonden tar miljö och/eller etisk hänsyn"]
[null,"Handelsbanken Lux Korträntefond",0,0,0,0,0,3,0.6,0.11,0.16,0.1,2.4,"SEK",2000,"Utländsk",718205,"Handelsbanken Funds","Sverige kortränta"]
[null,"Nordea Swedish Bond Stars",0,0,0,0,1,4,0.7,0.11,0.2,0.2,1.7,"SEK",2001,"Svensk",613133,"Nordea Funds Ab","Sverige kortränta","Fonden tar miljö och/eller etisk hänsyn"]
[null,"SPP Penningmarknadsfond",0,0,0,0,0,3,0.6,0.11,0.21,0.1,1.1000000000000001,"SEK",2010,"Svensk",442897,"SPP Fonder AB","Sverige kortränta","Fonden tar miljö och/eller etisk hänsyn"]
[null,"AP7 Aktiefond",5,-4,-2,13,41,144,19.5,0.11,0.11,14.8,0.9,"SEK",2010,"Svensk",581371,"Sjunde AP-Fonden","Global","Fonden tar miljö och/eller etisk hänsyn"]
{"$rows_left_out":847}
{"sheet":"Värdeutveckling - konto","index":4,"n_rows":45,"n_cols":3,"rows_kept":45,"cut":false,"hidden":false,"merged":[]}
[]
[]
[]
[]
[]
[]
[]
[null,null,"Nästa uppdatering: 2017-10-18"]
[]
[]
[]
[]
[]
[]
[]
[]
[]
[]
[]
[]
[]
[]
[]
[]
[]
[]
[]
[]
[]
[]
[]
[]
[]
[]
[]
[]
[]
[]
[]
[]
{"$rows_left_out":6}
{"sheet":"Värdeutv. Premiepensionssystem","index":5,"n_rows":70,"n_cols":7,"rows_kept":70,"cut":false,"hidden":false,"merged":[]}
[]
[]
[]
[]
[]
[null,null,null,null,null,null,{"$f":"'Värdeutveckling - konto'!C8","v":"Nästa uppdatering: 2017-10-18"}]
[]
[]
[]
[]
[]
[]
[]
[]
[]
[]
[]
[]
[]
[]
[]
[]
[]
[]
[]
[]
[]
[]
[]
[]
[]
[]
[]
[]
[]
[]
[]
[]
[]
[]
{"$rows_left_out":31}
{"sheet":"Värdeutv. fondrörelse per år","index":6,"n_rows":49,"n_cols":7,"rows_kept":49,"cut":false,"hidden":false,"merged":[]}
[]
[]
[]
[]
[null,null,null,null,null,null,{"$f":"'Värdeutveckling - konto'!C8","v":"Nästa uppdatering: 2017-10-18"}]
[]
[]
[]
[]
[]
[]
[]
[]
[]
[]
[]
[]
[]
[]
[]
[]
[]
[]
[]
[]
[]
[]
[]
[]
[]
[]
[]
[]
[]
[]
[]
[]
[]
[]
[]
{"$rows_left_out":10}
{"sheet":"Marknadsv. & tillfört kapital","index":7,"n_rows":44,"n_cols":7,"rows_kept":44,"cut":false,"hidden":false,"merged":[]}
[]
[]
[]
[]
[]
[]
[null,null,null,null,null,null,{"$f":"'Värdeutveckling - konto'!C8","v":"Nästa uppdatering: 2017-10-18"}]
[]
[]
[]
[]
[]
[]
[]
[]
[]
[]
[]
[]
[]
[]
[]
[]
[]
[]
[]
[]
[]
[]
[]
[]
[]
[]
[]
[]
[]
[]
[]
[]
[]
{"$rows_left_out":5}
{"sheet":"Värdeutveckling - fondrörelse","index":8,"n_rows":46,"n_cols":7,"rows_kept":46,"cut":false,"hidden":false,"merged":[]}
[]
[]
[]
[]
[]
[null,null,null,null,null,null,{"$f":"'Värdeutveckling - konto'!C8","v":"Nästa uppdatering: 2017-10-18"}]
[]
[]
[]
[]
[]
[]
[]
[]
[]
[]
[]
[]
[]
[]
[]
[]
[]
[]
[]
[]
[]
[]
[]
[]
[]
[]
[]
[]
[]
[]
[]
[]
[]
[]
{"$rows_left_out":7}
{"sheet":"Värdeutv fondrörelse genomsnitt","index":9,"n_rows":47,"n_cols":7,"rows_kept":47,"cut":false,"hidden":false,"merged":[]}
[]
[]
[]
[]
[]
[null,null,null,null,null,null,{"$f":"'Värdeutveckling - konto'!C8","v":"Nästa uppdatering: 2017-10-18"}]
[]
[]
[]
[]
[]
[]
[]
[]
[]
[]
[]
[]
[]
[]
[]
[]
[]
[]
[]
[]
[]
[]
[]
[]
[]
[]
[]
[]
[]
[]
[]
[]
[]
[]
{"$rows_left_out":8}
{"sheet":"Avkastning pp-systemet","index":10,"n_rows":232,"n_cols":6,"rows_kept":232,"cut":false,"hidden":false,"merged":[[24,2,25,2],[24,3,25,3],[24,4,25,4],[24,5,25,5]]}
[]
[]
[]
[]
[null,"Värdeutveckling - Premiepensionssystemet",null,null,null,{"$f":"'Värdeutveckling - konto'!C8","v":"Nästa uppdatering: 2017-10-18"}]
[]
[null,"Siffrorna omfattar både avkastningen i fondrörelsen och avkastningen av pengarna fram till tidpunkten då de placerades i fonderna."]
[null,"Kapitalviktad avkastning anger genomsnittlig årlig utveckling för en genomsnittlig persons premiepensionskonto. "]
[null,"Måttet kan jämföras med räntan på ett bankkonto."]
[null,"Den kapitalviktade avkastningen kan inte jämföras med marknadsindex eller med enskilda fonders avkastning. "]
[null,"Balansindex är den siffra med vilken inkomstpensionen räknas upp årligen och är jämförbar med den kapitalviktade årsavkastningen."]
[]
[null,"I tabellen nedan kan man därför jämföra den genomsnittlige personens avkastning i premiepensionssystemet "]
[null,"med personens avkastning i inkomstpensionen. "]
[]
[null,"Med årsavkastning avses genomsnittlig årsavkastning sedan start."]
[]
[]
[]
[]
[]
[]
[]
[]
[null,"Datum","Kapitalviktad \nårsavkastning (IR)","Real kapitalviktad årsavkastning (IR)","Balansindex, (IR)","Balansindex, realt (IR) *"]
[]
[null,"2000-12-13",4.1944485443448101E-2,3.4185081486749702E-2]
[null,"2000-12-31",2.9172234535217278E-2,2.1548629423359555E-2,2.2797217369079588E-2,1.4385435572878524E-2]
[null,"2001-01-31",3.4470444993645266E-2,2.7404682439887473E-2]
[null,"2001-02-28",1.5265800868734553E-2,7.8503517895816E-3]
[null,"2001-03-31",-1.8410568162869163E-3,-1.0267239300616793E-2]
[null,"2001-04-30",2.0691238008785837E-2,1.0771200659497771E-2]
[null,"2001-05-31",2.985371110015975E-2,1.8881108471976438E-2]
[null,"2001-06-30",2.1832256757043877E-2,1.1325475944840457E-2]
[null,"2001-07-31",9.9048701493387632E-3,4.7028351006228597E-4]
[null,"2001-08-31",-5.8520358709966656E-3,-1.5417734422042306E-2]
[null,"2001-09-30",-2.8352978395008131E-2,-3.8834699205131495E-2]
[null,"2001-10-31",-1.585379730917981E-2,-2.5904718303681462E-2]
[null,"2001-11-30",1.5011297694889443E-3,-8.6559676423678678E-3]
[null,"2001-12-31",4.0387541055679332E-3,-6.1731336402864878E-3,2.3982968330383304E-2,1.2858501944238876E-2]
{"$rows_left_out":193}
{"sheet":"Index, fondrörelsen","index":11,"n_rows":20,"n_cols":19,"rows_kept":20,"cut":false,"hidden":false,"merged":[]}
[]
[]
[]
[" "]
[null,"Värdeutveckling - fondrörelsen per kalenderår",null,null,null,null,null,null,{"$f":"'Värdeutveckling - konto'!C8","v":"Nästa uppdatering: 2017-10-18"}]
[]
[null,"Avkastningen i fondrörelsen mäter avkastningen på en genomsnittlig krona som sattes in i början på året. "]
[null,"Det kan jämföras med marknadsindex och enskilda fonders avkastning. "]
[null,"Rabatter på fondavgifter, myndighetens avgift och arvsvinster är inte medräknade."]
[]
[]
[]
[]
[null,"Värdeutveckling",2001,2002,2003,2004,2005,"2006-12-31",2007,2008,2009,2010,2011,2012,"2013-12-31","2014-12-31","2015-12-31","2016-01-01","2017-08-31"]
[null,"Fondrörelsen1)",-0.111,-0.31223079839764201,0.1782730775091621,8.7501758829949594E-2,0.30552648011758543,0.12140116450721394,5.6636805614445285E-2,-0.34156819000074978,0.34685505788951732,0.12151293044644662,-0.10687426681227297,0.12125473461444458,0.21099999999999999,0.20699999999999999,6.4000000000000001E-2,0.10855501959583491,3.8204825235662154E-2]
[null,"Sjunde AP-fonden2)",-0.106,-0.26700000000000002,0.187,0.10100000000000001,0.251,0.105,4.7E-2,-0.36199999999999999,0.35141800246609134,0.14644453351666153,-0.10536246609942557,0.17497988455497548,0.318,0.29099999999999998,6.2E-2,0.15138751375459392,4.1635177379481192E-2]
[]
[null,"1) I beräkningen av värdeutvecklingen i fondrörelsen ingår alla fonder på fondtorget inklusive AP7 Aktiefond och AP7 Räntefond."]
[null,"2) I beräkningen av värdeutveckling för Sjunde AP-fondens förvaltning ingår AP7 Aktiefond och AP7 Räntefond."]
[null,"    AP7 gäller from och med 21 maj 2010, före detta datum gällde Premiesparfonden."]

{"sheet":"Marknadsv. och tillfört kapital","index":12,"n_rows":17,"n_cols":20,"rows_kept":17,"cut":false,"hidden":false,"merged":[]}
[]
[]
[]
[]
[]
[null,"Marknadsvärde och tillfört kapital till fondrörelsen",null,null,null,null,null,null,null,{"$f":"'Värdeutveckling - konto'!C8","v":"Nästa uppdatering: 2017-10-18"}]
[]
[null,"Tillfört kapital är pengar från den tillfälliga förvaltningen (inklusive ränta) samt återförda fondavgifter och arvsvinster. "]
[null,"Från det tillförda kapitalet har det dragits av för pensionsutbetalningar, myndighetens avgift, samt överföringar till "]
[null,"traditionell försäkring. Jämförelsen mellan marknadsvärde och tillfört kapital ger alltså inte en fullständig bild av "]
[null,"utvecklingen av de inbetalda pensionsrätterna."]
[]
[]
[]
[null,"Fondrörelsen",2000,2001,2002,2003,2004,2005,"2006-12-31","2007-12-31","2008-01-01","2009-12-31","2010-12-31","2011-12-31","2012-12-31","2013-12-31","2014-12-31","2015-12-31","2016-01-01","2017-08-31"]
[null,"Netto tillfört kapital, mdr",55.831616023629408,74.033547998326426,93.93715098490317,114.64956724755694,136.62021154457284,159.77779842054943,209,235.50159071018251,263.98657166722467,293.39683174242759,323.04324834873717,354.29697772737427,387,421,456,496,538.21494048724287,545.8672093897826]
[null,"Marknadsvärde, mdr",52.735199475111202,65.023593666597904,59.275358189472996,93.920076415257597,124.75628531142399,192.35696213467801,267,308.29568458589898,230.23493756186801,340.16227208294498,408.47751268748601,393.15689279941199,471,602,759,839,959.84765629860874,993.08487283563193]

{"sheet":"Avkastning sedan 2000","index":13,"n_rows":225,"n_cols":6,"rows_kept":225,"cut":false,"hidden":false,"merged":[[21,13,22,13],[21,14,22,14],[21,2,22,2],[21,3,22,3],[21,4,22,4],[21,5,22,5],[21,11,22,11],[21,12,22,12]]}
[]
[]
[]
[]
[null,"Värdeutveckling - fondrörelsen i genomsnitt per år"]
[]
[null,{"$f":"'Värdeutveckling - konto'!C8","v":"Nästa uppdatering: 2017-10-18"}]
[]
[]
[null,"Tidsviktad avkastning (TVA), mäter avkastningen på en genomsnittlig krona som sattes in i premiepensionssystemet 2000-12-13. "]
[null,"Premiepensionsindex kan jämföras med marknadsindex och enskilda fonders avkastning. Rabatten på fondavgiften,"]
[null," myndighetens avgift och arvsvinster är inte medräknade. "]
[]
[null,"Real avkastning = avkastning/inflation (KPI) "]
[null,"Med årsavkastningn menas genomsnittlig avkastning sedan start. "]
[]
[]
[]
[]
[]
[]
[null,"Datum","Tidsviktad årsavkastning (TVA)","Real tidsviktad årsavkastning (TVA)","Tidsviktad avkastning sedan start (TVA)","Real tidsviktad avkastning sedan start (TVA)"]
[]
[null,"2000-12-13",0,0,0]
[null,"2000-12-31",-4.5388155165690725E-2,-4.4660831855340755E-2,-4.5388155165690725E-2,-4.4660831855340755E-2]
[null,"2001-01-31",-2.3061835549637144E-2,-1.9328789449330031E-2,-2.3061835549637144E-2,-1.9328789449330031E-2]
[null,"2001-02-28",-9.3336214097018311E-2,-9.2990949898273945E-2,-9.3336214097018311E-2,-9.2990949898273945E-2]
[null,"2001-03-31",-0.15455948709528244,-0.16063029954622343,-0.15455948709528244,-0.16063029954622343]
[null,"2001-04-30",-0.10298425231858033,-0.1170998991535821,-0.10298425231858033,-0.1170998991535821]
[null,"2001-05-31",-7.016137882463358E-2,-9.0924429539379514E-2,-7.016137882463358E-2,-9.0924429539379514E-2]
[null,"2001-06-30",-9.557327690967421E-2,-0.11445061440242799,-9.557327690967421E-2,-0.11445061440242799]
[null,"2001-07-31",-0.13384481410068805,-0.14747483201292899,-0.13384481410068805,-0.14747483201292899]
[null,"2001-08-31",-0.18550338163818569,-0.20041755738546863,-0.18550338163818569,-0.20041755738546863]
[null,"2001-09-30",-0.25676123723683508,-0.27658828092670085,-0.25676123723683508,-0.27658828092670085]
[null,"2001-10-31",-0.21912568174453229,-0.23769720027606334,-0.21912568174453229,-0.23769720027606334]
[null,"2001-11-30",-0.16090624193691538,-0.18116667814571941,-0.16090624193691538,-0.18116667814571941]
[null,"2001-12-31",-0.15163030159442259,-0.17303629027404399,-0.15163030159442259,-0.17303629027404399]
[null,"2002-01-31",-0.16226125402914071,-0.17982548286273181,-0.18662022488362295,-0.20507862007785627]
[null,"2002-02-28",-0.15995282583486503,-0.17789240716081489,-0.19577125072951806,-0.21577248539957083]
[null,"2002-03-31",-0.13668758570700124,-0.1598893652815141,-0.17796435824374601,-0.20548652285000768]
{"$rows_left_out":186}
{"sheet":"Beskrivning av mått","index":14,"n_rows":21,"n_cols":3,"rows_kept":21,"cut":false,"hidden":false,"merged":[]}
[]
[]
[]
[]
[null,null,"Beskrivning av mått"]
[]
[]
[]
[]
[null,null,"Snitt 5 år:                        Geometriska medelvärdet av fondernas värdeutveckling i SEK för de senaste 60 månaderna (5 år)."]
[]
[null,null,"Risk:                               Standardavvikelse, 36 månader, anger hur kursutvecklingen avviker från medelvärdet."]
[]
[null,null,"Fondavgift, % netto:       TER minus myndighetens rabatt, pensionsspararens avgift till förvaltaren."]
[]
[null,null,"Fondavgift, % brutto:      Motsvarar TER. "]
[]
[null,null,"TER:                               (Total expence ratio) När myndighetens rabatt på fondavgiften beräknas används TER. I TER ingår fondens alla "]
[null,null,"                                       kostnader utom transaktionskostnader, kupongskatt, räntekostnader eller valutaförluster."]
[]
[null,null,"Sharpe-kvot:                   Ett mått på riskjusterad avkastning. Sharpe-kvot = (Värdeutvecklingen hos fonden - riskfria räntan) / Standardavvikelsen hos fonden (risk)."]

{"sheet":"Info Makro","index":15,"n_rows":27,"n_cols":2,"rows_kept":27,"cut":false,"hidden":false,"merged":[]}
[]
[]
[]
[]
[null,"För att kunna få tillgång till enkel sorteringsfunktionalitet i vissa blad behöver man aktivera makron."]
[null,"Detta görs genom att klicka på \"Aktivera makron\" när detta dokument öppnas (se nedan). "]
[null,"Har du valt att klicka på \"Inaktivera makron\" när detta dokument öppnades och vill kunna använda"]
[null,"sorteringsfunktionaliteten måste du stänga dokumentet och öppna på nytt med valet \"Aktivera makron\"."]
[]
[null,"Man kan även sortera manuellt om man inte vill utnyttja makrofunktionaliteten. Gå då direkt till"]
[null,"innehållsförteckningen genom att klicka på knappen här bredvid."]
[]
[]
[]
[]
[]
[]
[]
[]
[]
[]
[]
[]
[]
[null,"Kan du ändå inte sortera?"]
[null,"Då kan inställningarna till säkerhetsnivån för makron vara för hög på din dator. Ett alternativ"]
[null,"kan då vara att kontakta nätverksadministratören på din arbetsplats."]