{"text_format":"1","workbook":"xlsx","n_sheets":16,"sheets":["Innehåll","Fondval & marknadsvärde","10 fonder...","Fondstatistik","Värdeutveckling - konto","Värdeutv. Premiepensionssystem","Värdeutv. fondrörelse per år","Marknadsv. & tillfört kapital","Värdeutveckling - fondrörelse","Värdeutv fondrörelse genomsnitt","Avkastning pp-systemet","Index, fondrörelsen","Marknadsv. och tillfört kapital","Avkastning sedan 2000","Beskrivning av mått","Info Makro"],"not_rendered":{"charts":6,"images":7,"macros":1,"external_links":1,"defined_names":22,"comments":1,"pivot_tables":0},"unopened":[],"bounds":{"document_bytes":16777216,"sheet_cells":100000,"rows_first":2000,"rows_last":500,"rows_between":2000,"halvings":0,"cell_chars":16384,"cell_head_chars":4096},"cells_cut":0,"cells_raw":0,"read":"whole","date_system":"1900"}

{"sheet":"Innehåll","index":0,"n_rows":23,"n_cols":2,"rows_kept":23,"cut":false,"hidden":false,"merged":[]}
[]
[]
[]
[]
[]
[]
[]
[null,"Månadsstatistik om premiepension"]
[]
[null,"INNEHÅLLSFÖRTECKNING"]
[null,"(klicka på resp rubrik för att komma till sidan)"]
[]
[null,"Fondval och aktuellt marknadsvärde"]
[null,"De tio mest valda fonderna m.m"]
[null,"Fondstatistik"]
[null,"Värdeutveckling - individuella konton"]
[null,"Värdeutveckling - pensionssystemet"]
[null,"Värdeutveckling för fondrörelsen per kalenderår"]
[null,"Marknadsvärde och tillfört kapital till fondrörelsen"]
[null,"Värdeutveckling för premiepensionsfondernas index"]
[null,"Värdeutveckling för fondrörelsen i genomsnitt per år"]
[null,""]
[null,"Beskrivning av mått"]

{"sheet":"Fondval & marknadsvärde","index":1,"n_rows":866,"n_cols":15,"rows_kept":866,"cut":false,"hidden":false,"merged":[]}
[]
[]
[]
[null,null,null,null,null,null,null,null,null,null,null,null,null,null,"Totalt marknadsvärde  "]
[null,null,null,null,null,null,null,null,null,null,null,null,null,null,{"$f":"ROUND(SUM(H23:H1000)/1000000000,0)","v":1162}]
["Antal fondval och marknadsvärde i fonderna 2018-04-30",null,null,null,null,null,null,null,null,null,null,null,null,null," miljarder kronor"]
["Nästa uppdatering: 2018-06-09"]
["Antal fondval, visar aktuellt läge vid månadsslut. "]
["Marknadsvärde = Fondandelar * Fondkurs * Valutakurs."]
[{"$f":"CONCATENATE(O4,O5,O6)","v":"Totalt marknadsvärde  1162 miljarder kronor"}]
[]
[]
[]
[]
[]
[]
[]
[]
["Klicka på kolumnnamnen för att sortera på respektive kolumn."]
[]
[null,null,null,"Antal fondval","Antal fondval",null,"Marknadsvärde","Marknadsvärde",null,null,null,null,"Svensk/ "]
["Fondnummer","Fondnamn","Kvinnor","Män","Total","Kvinnor","Män","Total","Handel, netto","Fondkategori","Fondtyp","Förvaltare","Utländsk"]
[1,"AP7 Såfa - Statens årskullsförvaltningsalternativ",1878547,2023766,3902313,193031757811,240184560884,433216318695,null,"Statens förvaltningsalternativ","Generationsfonder","Sjunde AP-fonden","Svensk"]
[283408,"Swedbank Robur Technology",140181,153023,293204,10412877748,14364631263,24777509012,-3341214,"IT och kommunikation","Aktiefonder","Swedbank Robur Fonder AB","Svensk"]
[291906,"Didner & Gerge Aktiefond",109352,120639,229991,10743293150,14126085085,24869378235,-134212167,"Sverige","Aktiefonder","Didner & Gerge Fonder AB","Svensk"]
[681783,"AMF Aktiefond Sverige",107997,114002,221999,8826727593,11633954423,20460682016,-91208064,"Sverige","Aktiefonder","AMF Fonder AB","Svensk"]
[645952,"AMF Aktiefond Världen",99808,102325,202133,7689595567,9936356699,17625952265,-76030403,"Global och Sverige","Aktiefonder","AMF Fonder AB","Svensk"]
[785022,"Swedbank Robur Aktiefond Pension",85766,73742,159508,7890424511,8215518357,16105942869,-32074735,"Global och Sverige","Aktiefonder","Swedbank Robur Fonder AB","Svensk"]
[747899,"Swedbank Robur Transfer 80",64211,63971,128182,10345751798,12693078106,23038829904,-37304333,"Pension om mer än 10 år","Generationsfonder","Swedbank Robur Fonder AB","Svensk"]
[581371,"AP7 Aktiefond",50198,73520,123718,6345140337,10164805484,16509945821,-303116483,"Global","Aktiefonder","Sjunde AP-Fonden","Svensk"]
{"$rows_left_out":837}
{"sheet":"10 fonder...","index":2,"n_rows":61,"n_cols":15,"rows_kept":61,"cut":false,"hidden":false,"merged":[[9,2,9,4],[9,5,9,7],[23,5,23,7],[23,2,23,4]]}
[]
[]
[]
[]
[null,{"$f":"Fondstatistik!A5","v":"Fondstatistik per 2018-04-30"}]
[null,{"$f":"'Fondval & marknadsvärde'!A7","v":"Nästa uppdatering: 2018-06-09"}]
[]
[]
[null,"De tio mest valda fonderna"]
[null,"Fondnamn","Antal fondval",null,null,"Marknadsvärde",null,null,"Värdeutveckling",null,null,"Värdeutveckling  "]
[null,null,"Kvinnor","Män","Total","Kvinnor","Män","Total",2018,null,"Ange din ålder","AP7 Såfa 2018",null,"AP7 Aktiefond","AP7 Räntefond"]
[null,"AP7 Såfa - Statens årskullsförvaltningsalternativ",1878547,2023766,3902313,193031757811,240184560884,433216318695,null,null,null,null,null,{"$f":"VLOOKUP(N11,Fondstatistik!B22:H850,2,)","v":7},{"$f":"VLOOKUP(O11,Fondstatistik!B22:I850,2,)","v":0}]
[null,"Swedbank Robur Technology",140181,153023,293204,10412877748,14364631263,24777509012,{"$f":"VLOOKUP($B$12:$B$21,Fondstatistik!$B$24:$Q$998,2,FALSE)","v":11}]
[null,"Didner & Gerge Aktiefond",109352,120639,229991,10743293150,14126085085,24869378235,{"$f":"VLOOKUP($B$12:$B$21,Fondstatistik!$B$24:$Q$998,2,FALSE)","v":2}]
[null,"AMF Aktiefond Sverige",107997,114002,221999,8826727593,11633954423,20460682016,{"$f":"VLOOKUP($B$12:$B$21,Fondstatistik!$B$24:$Q$998,2,FALSE)","v":4}]
[null,"AMF Aktiefond Världen",99808,102325,202133,7689595567,9936356699,17625952265,{"$f":"VLOOKUP($B$12:$B$21,Fondstatistik!$B$24:$Q$998,2,FALSE)","v":4}]
[null,"Swedbank Robur Aktiefond Pension",85766,73742,159508,7890424511,8215518357,16105942869,{"$f":"VLOOKUP($B$12:$B$21,Fondstatistik!$B$24:$Q$998,2,FALSE)","v":7}]
[null,"Swedbank Robur Transfer 80",64211,63971,128182,10345751798,12693078106,23038829904,{"$f":"VLOOKUP($B$12:$B$21,Fondstatistik!$B$24:$Q$998,2,FALSE)","v":5}]
[null,"AP7 Aktiefond",50198,73520,123718,6345140337,10164805484,16509945821,{"$f":"VLOOKUP($B$12:$B$21,Fondstatistik!$B$24:$Q$998,2,FALSE)","v":7}]
[null,"Swedbank Robur Transfer 70",65901,50711,116612,11142803162,10079172081,21221975244,{"$f":"VLOOKUP($B$12:$B$21,Fondstatistik!$B$24:$Q$998,2,FALSE)","v":5}]
[null,"AMF Balansfond",59653,53809,113462,4067852739,4582569177,8650421916,{"$f":"VLOOKUP($B$12:$B$21,Fondstatistik!$B$24:$Q$998,2,FALSE)","v":3}]
[]
[null,"De tio fonderna med mest kapital"]
[null,"Fondnamn","Antal fondval",null,null,"Marknadsvärde",null,null,"Värdeutveckling"]
[null,null,"Kvinnor","Män","Total","Kvinnor","Män","Total",2018]
[null,"AP7 Såfa - Statens årskullsförvaltningsalternativ",1878547,2023766,3902313,193031757811,240184560884,433216318695]
[null,"Didner & Gerge Aktiefond",109352,120639,229991,10743293150,14126085085,24869378235,{"$f":"VLOOKUP($B$27:$B$35,Fondstatistik!$B$24:$Q$998,2,FALSE)","v":2}]
[null,"Swedbank Robur Technology",140181,153023,293204,10412877748,14364631263,24777509012,{"$f":"VLOOKUP($B$27:$B$35,Fondstatistik!$B$24:$Q$998,2,FALSE)","v":11}]
[null,"Swedbank Robur Transfer 80",64211,63971,128182,10345751798,12693078106,23038829904,{"$f":"VLOOKUP($B$27:$B$35,Fondstatistik!$B$24:$Q$998,2,FALSE)","v":5}]
[null,"Swedbank Robur Transfer 70",65901,50711,116612,11142803162,10079172081,21221975244,{"$f":"VLOOKUP($B$27:$B$35,Fondstatistik!$B$24:$Q$998,2,FALSE)","v":5}]
{"$rows_left_out":32}
{"sheet":"Fondstatistik","index":3,"n_rows":865,"n_cols":21,"rows_kept":865,"cut":false,"hidden":false,"merged":[[19,2,19,9],[19,10,19,11]]}
[]
[]
[]
[]
["Fondstatistik per 2018-04-30"]
[{"$f":"'Fondval & marknadsvärde'!A7","v":"Nästa uppdatering: 2018-06-09"}]
[]
[]
[]
["Klicka på resp rubrik för att sortera (stigande eller fallande)"]
[]
[]
[]
[]
[]
[]
[]
["Klicka på kolumnnamnen för att sortera på respektive kolumn."]
[]
[null,null,"Värdeutveckling i SEK (%)",null,null,null,null,null,null,null,"Fondavgift (%)",null,null,"Sharpe-","Noterings-",null,"Svensk/"]
["Fondnummer","Fondnamn","I år","1 mån.","3 mån.","6 mån.","12 mån.","36 mån.","60 mån.","Snitt 5 år","Netto","Brutto (TER)","Risk","kvot","valuta","Startdatum","Utländsk","ISIN-kod","Förvaltare","Fondkategori","Etisk"]
[734491,"Avanza Zero - Fonden utan avgifter",3,4,2,-3,1,8,57,9.5,0,0,12.2,0.3,"SEK",2006,"Svensk","SE0001718388","Avanza Fonder AB","Sverige"]
[717611,"Swedbank Robur Penningmarknadsfond",0,0,0,0,0,0,1,0.2,0,0,0.1,1.3,"SEK",2000,"Svensk","SE0000543043","Swedbank Robur Fonder AB","Sverige kortränta","Fonden tar miljö och/eller etisk hänsyn"]
[278853,"Handelsbanken Pension 70",6,6,5,5,10,22,90,13.8,0.01,0.01,12,0.6,"SEK",2012,"Utländsk","LU0809910291","Handelsbanken Funds","Pension om mer än 10 år"]
[243022,"Handelsbanken Pension 80",6,6,5,5,10,23,91,13.8,0.01,0.01,11.9,0.7,"SEK",2012,"Utländsk","LU0809910457","Handelsbanken Funds","Pension om mer än 10 år"]
[337709,"Handelsbanken Pension 90",6,6,5,6,11,24,null,null,0.01,0.01,11.6,0.7,"SEK",2015,"Utländsk","LU0809910614","Handelsbanken Funds","Pension om mer än 10 år"]
[350512,"Handelsbanken Pension 60",5,5,4,4,9,20,87,13.3,0.01,0.01,11.7,0.6,"SEK",2012,"Utländsk","LU0809909954","Handelsbanken Funds","Pension om mer än 10 år"]
[314682,"Handelsbanken Pension 50",3,3,3,3,6,13,56,9.3000000000000007,0.01,0.01,7.3,0.6,"SEK",2012,"Utländsk","LU0809909798","Handelsbanken Funds","Pension om mindre än 10 år"]
[167114,"Handelsbanken Pension 40",2,2,2,2,4,7,27,5,0.01,0.01,3.4,0.8,"SEK",2012,"Utländsk","LU0809909442","Handelsbanken Funds","Pension om mindre än 10 år"]
[545541,"AP7 Räntefond",0,0,0,0,0,1,6,1.1000000000000001,0.04,0.04,0.4,1.4,"SEK",2010,"Svensk","SE0003299981","Sjunde AP-Fonden","Sverige lång och realränta","Fonden tar miljö och/eller etisk hänsyn"]
{"$rows_left_out":836}
{"sheet":"Värdeutveckling - konto","index":4,"n_rows":45,"n_cols":3,"rows_kept":45,"cut":false,"hidden":false,"merged":[]}
[]
[]
[]
[]
[]
[]
[]
[null,null,"Nästa uppdatering: 2018-06-16"]
[]
[]
[]
[]
[]
[]
[]
[]
[]
[]
[]
[]
[]
[]
[]
[]
[]
[]
[]
[]
[]
[]
{"$rows_left_out":16}
{"sheet":"Värdeutv. Premiepensionssystem","index":5,"n_rows":70,"n_cols":3,"rows_kept":70,"cut":false,"hidden":false,"merged":[]}
[]
[]
[]
[]
[null,{"$f":"'Värdeutveckling - konto'!C8","v":"Nästa uppdatering: 2018-06-16"}]
[]
[]
[]
[]
[]
[]
[]
[]
[]
[]
[]
[]
[]
[]
[]
[]
[]
[]
[]
[]
[]
[]
[]
[]
[]
{"$rows_left_out":41}
{"sheet":"Värdeutv. fondrörelse per år","index":6,"n_rows":49,"n_cols":3,"rows_kept":49,"cut":false,"hidden":false,"merged":[]}
[]
[]
[]
[]
[null,{"$f":"'Värdeutveckling - konto'!C8","v":"Nästa uppdatering: 2018-06-16"}]
[]
[]
[]
[]
[]
[]
[]
[]
[]
[]
[]
[]
[]
[]
[]
[]
[]
[]
[]
[]
[]
[]
[]
[]
[]
{"$rows_left_out":20}
{"sheet":"Marknadsv. & tillfört kapital","index":7,"n_rows":46,"n_cols":3,"rows_kept":46,"cut":false,"hidden":false,"merged":[]}
[]
[]
[]
[]
[]
[]
[null,{"$f":"'Värdeutveckling - konto'!C8","v":"Nästa uppdatering: 2018-06-16"}]
[]
[]
[]
[]
[]
[]
[]
[]
[]
[]
[]
[]
[]
[]
[]
[]
[]
[]
[]
[]
[]
[]
[]
{"$rows_left_out":17}
{"sheet":"Värdeutveckling - fondrörelse","index":8,"n_rows":46,"n_cols":3,"rows_kept":46,"cut":false,"hidden":false,"merged":[]}
[]
[]
[]
[]
[null,{"$f":"'Värdeutveckling - konto'!C8","v":"Nästa uppdatering: 2018-06-16"}]
[]
[]
[]
[]
[]
[]
[]
[]
[]
[]
[]
[]
[]
[]
[]
[]
[]
[]
[]
[]
[]
[]
[]
[]
[]
{"$rows_left_out":17}
{"sheet":"Värdeutv fondrörelse genomsnitt","index":9,"n_rows":47,"n_cols":3,"rows_kept":47,"cut":false,"hidden":false,"merged":[]}
[]
[]
[]
[]
[null,{"$f":"'Värdeutveckling - konto'!C8","v":"Nästa uppdatering: 2018-06-16"}]
[]
[]
[]
[]
[]
[]
[]
[]
[]
[]
[]
[]
[]
[]
[]
[]
[]
[]
[]
[]
[]
[]
[]
[]
[]
{"$rows_left_out":18}
{"sheet":"Avkastning pp-systemet","index":10,"n_rows":236,"n_cols":6,"rows_kept":236,"cut":false,"hidden":false,"merged":[[24,2,25,2],[24,3,25,3],[24,4,25,4],[24,5,25,5]]}
[]
[]
[]
[]
[null,"Värdeutveckling - Premiepensionssystemet"]
[null,{"$f":"'Värdeutveckling - konto'!C8","v":"Nästa uppdatering: 2018-06-16"}]
[null,"Siffrorna omfattar både avkastningen i fondrörelsen och avkastningen av pengarna fram till tidpunkten då de placerades i fonderna."]
[null,"Kapitalviktad avkastning anger genomsnittlig årlig utveckling för en genomsnittlig persons premiepensionskonto. "]
[null,"Måttet kan jämföras med räntan på ett bankkonto."]
[null,"Den kapitalviktade avkastningen kan inte jämföras med marknadsindex eller med enskilda fonders avkastning. "]
[null,"Balansindex är den siffra med vilken inkomstpensionen räknas upp årligen och är jämförbar med den kapitalviktade årsavkastningen."]
[]
[null,"I tabellen nedan kan man därför jämföra den genomsnittlige personens avkastning i premiepensionssystemet "]
[null,"med personens avkastning i inkomstpensionen. "]
[]
[null,"Med årsavkastning avses genomsnittlig årsavkastning sedan start."]
[]
[]
[]
[]
[]
[]
[]
[]
[null,"Datum","Kapitalviktad \nårsavkastning (IR)","Real kapitalviktad årsavkastning (IR)","Balansindex, (IR)","Balansindex, realt (IR) *"]
[]
[null,"2000-12-13",4.1944485443448101E-2,3.4185081486749702E-2]
[null,"2000-12-31",2.9172234535217278E-2,2.1548629423359555E-2,2.2797217369079588E-2,1.4385435572878524E-2]
[null,"2001-01-31",3.4470444993645266E-2,2.7404682439887473E-2]
[null,"2001-02-28",1.5265800868734553E-2,7.8503517895816E-3]
{"$rows_left_out":207}
{"sheet":"Index, fondrörelsen","index":11,"n_rows":22,"n_cols":20,"rows_kept":22,"cut":false,"hidden":false,"merged":[]}
[]
[]
[]
[" "]
[null,"Värdeutveckling - fondrörelsen per kalenderår"]
[null,{"$f":"'Värdeutveckling - konto'!C8","v":"Nästa uppdatering: 2018-06-16"}]
[null,"Avkastningen i fondrörelsen mäter avkastningen på en genomsnittlig krona som sattes in i början på året. "]
[null,"Det kan jämföras med marknadsindex och enskilda fonders avkastning. "]
[null,"Rabatter på fondavgifter, myndighetens avgift och arvsvinster är inte medräknade."]
[]
[]
[]
[]
[null,"Värdeutveckling",2001,2002,2003,2004,2005,"2006-12-31",2007,2008,2009,2010,2011,2012,"2013-12-31","2014-12-31","2015-12-31","2016-01-01","2017-12-31","2018-03-31"]
[null,"Fondrörelsen 1)",-0.111,-0.31223079839764201,0.1782730775091621,8.7501758829949594E-2,0.30552648011758543,0.12140116450721394,5.6636805614445285E-2,-0.34156819000074978,0.34685505788951732,0.12151293044644662,-0.10687426681227297,0.12125473461444458,0.21099999999999999,0.20699999999999999,6.4000000000000001E-2,0.10855501959583491,0.12569489215081098,5.163672561283783E-2]
[null,"Sjunde AP-fonden 2)",-0.106,-0.26700000000000002,0.187,0.10100000000000001,0.251,0.105,4.7E-2,-0.36199999999999999,0.35141800246609134,0.14644453351666153,-0.10536246609942557,0.17497988455497548,0.318,0.29099999999999998,6.2E-2,0.15138751375459392,0.16351530485196797,6.0981257257852528E-2]
[null,"Traditionell försäkring",4.1691826923077047E-2,3.8685865587554158E-2,3.3331727793022514E-2,4.8354052976949724E-2,5.1664705500169772E-2,5.9999993759661807E-2,5.6646964711991155E-2,2.1523620769253071E-2,1.0750188371345448E-2,4.5851349005140873E-2,3.7478052648876936E-2,5.000001243286567E-2,4.4115418197783862E-2,6.8234846767015522E-2,0.12601672774751971,4.9905351813315679E-2,5.0856518959069286E-2,2.012858397615136E-2]
[]
[]
[null,"1) I beräkningen av värdeutvecklingen i fondrörelsen ingår alla fonder på fondtorget inklusive AP7 Aktiefond och AP7 Räntefond."]
[null,"2) Fram till och med 2010-04-21 är beräkningen gjord för Premiesparfonden, därefter är beräkningen gjord för AP7 Såfa"]
[null,"   I beräkningen av värdeutveckling för Sjunde AP-fondens förvaltning ingår AP7 Aktiefond och AP7 Räntefond."]

{"sheet":"Marknadsv. och tillfört kapital","index":12,"n_rows":17,"n_cols":21,"rows_kept":17,"cut":false,"hidden":false,"merged":[]}
[]
[]
[]
[]
[]
[null,"Marknadsvärde och tillfört kapital till fondrörelsen"]
[null,{"$f":"'Värdeutveckling - konto'!C8","v":"Nästa uppdatering: 2018-06-16"}]
[null,"Tillfört kapital är pengar från den tillfälliga förvaltningen (inklusive ränta) samt återförda fondavgifter och arvsvinster. "]
[null,"Från det tillförda kapitalet har det dragits av för pensionsutbetalningar, myndighetens avgift, samt överföringar till "]
[null,"traditionell försäkring. Jämförelsen mellan marknadsvärde och tillfört kapital ger alltså inte en fullständig bild av "]
[null,"utvecklingen av de inbetalda pensionsrätterna."]
[]
[]
[]
[null,"Fondrörelsen",2000,2001,2002,2003,2004,2005,"2006-12-31","2007-12-31","2008-01-01","2009-12-31","2010-12-31","2011-12-31","2012-12-31","2013-12-31","2014-12-31","2015-12-31","2016-01-01","2017-12-31","2018-04-30"]
[null,"Netto tillfört kapital, mdr",55.831616023629408,74.033547998326426,93.93715098490317,114.64956724755694,136.62021154457284,159.77779842054943,209,235.50159071018251,263.98657166722467,293.39683174242759,323.04324834873717,354.29697772737427,387,421,456,496,538.21494048724287,584.96366813040015,583.70596945977422]
[null,"Marknadsvärde, mdr",52.735199475111202,65.023593666597904,59.275358189472996,93.920076415257597,124.75628531142399,192.35696213467801,267,308.29568458589898,230.23493756186801,340.16227208294498,408.47751268748601,393.15689279941199,471,602,759,839,959.84765629860874,1110.00111086684,1162.15894399748]

{"sheet":"Avkastning sedan 2000","index":13,"n_rows":235,"n_cols":11,"rows_kept":235,"cut":false,"hidden":false,"merged":[[21,2,22,2],[21,3,22,3],[19,2,20,5],[19,7,20,10],[21,9,22,9],[21,10,22,10],[21,7,22,7],[21,8,22,8],[23,13,24,13],[23,14,24,14],[21,4,22,4],[21,5,22,5],[23,11,24,11],[23,12,24,12]]}
[]
[]
[]
[]
[null,"Värdeutveckling - fondrörelsen och traditionell försäkring i genomsnitt per år"]
[null,{"$f":"'Värdeutveckling - konto'!C8","v":"Nästa uppdatering: 2018-06-16"}]
[]
[null,"Tidsviktad avkastning (TVA), mäter avkastningen på en genomsnittlig krona som sattes in i premiepensionssystemet 2000-12-13. "]
[null,"Premiepensionsindex kan jämföras med marknadsindex och enskilda fonders avkastning. Rabatten på fondavgiften,"]
[null," myndighetens avgift och arvsvinster är inte medräknade. "]
[]
[null,"Real avkastning = avkastning/inflation (KPI) "]
[null,"Med årsavkastningn menas genomsnittlig avkastning sedan start. "]
[]
[]
[]
[]
[]
[]
[null,null,"Fondförsäkring",null,null,null,null,"Traditionell försäkring"]
[]
[null,null,"Tidsviktad årlig genomsnittlig avkastning (TVA)","Real tidsviktad genomsnittlig årlig avkastning (TVA)","Tidsviktad avkastning sedan start (TVA)","Real tidsviktad avkastning sedan start (TVA)",null,"Tidsviktad årlig genomsnittlig avkastning (TVA)","Real tidsviktad genomsnittlig årlig avkastning (TVA)","Tidsviktad avkastning sedan start (TVA)","Real tidsviktad avkastning sedan start (TVA)"]
[]
[null,"Datum"]
[null,null,"Fondförsäkring","Fondförsäkring, realt","Fondförsäkring","Fondförsäkring, realt",null,"Traditionell försäkring","Traditionell försäkring, realt","Traditionell försäkring","Traditionell försäkring, realt"]
[null,"2000-12-13",0,0,0,null,null,0,0,0,0]
[null,"2000-12-31",-4.5388155165690725E-2,-4.4660831855340755E-2,-4.5388155165690725E-2,-4.4660831855340755E-2,null,1.1640499318982256E-2,1.5795074585558622E-2,1.9307398035002254E-3,2.6941156052553428E-3]
[null,"2001-01-31",-2.3061835549637144E-2,-1.9328789449330031E-2,-2.3061835549637144E-2,-1.9328789449330031E-2,null,3.2063041930792791E-2,2.5013722706562325E-2,5.2738165921466518E-3,9.115138015884261E-3]
[null,"2001-02-28",-9.3336214097018311E-2,-9.2990949898273945E-2,-9.3336214097018311E-2,-9.2990949898273945E-2,null,3.3627617373348517E-2,2.6078054532878925E-2,8.3029229691562456E-3,8.6868920944300765E-3]
[null,"2001-03-31",-0.15455948709528244,-0.16063029954622343,-0.15455948709528244,-0.16063029954622343,null,3.5411837598752882E-2,2.6671176454932777E-2,1.1667290786023354E-2,4.4028620162066545E-3]
{"$rows_left_out":206}
{"sheet":"Beskrivning av mått","index":14,"n_rows":21,"n_cols":2,"rows_kept":21,"cut":false,"hidden":false,"merged":[]}
[]
[]
[]
[]
[null,"Beskrivning av mått"]
[]
[]
[]
[]
[null,"Snitt 5 år:                        Geometriska medelvärdet av fondernas värdeutveckling i SEK för de senaste 60 månaderna (5 år)."]
[]
[null,"Risk:                               Standardavvikelse, 36 månader, anger hur kursutvecklingen avviker från medelvärdet."]
[]
[null,"Fondavgift, % netto:       TER minus myndighetens rabatt, pensionsspararens avgift till förvaltaren."]
[]
[null,"Fondavgift, % brutto:      Motsvarar TER. "]
[]
[null,"TER:                               (Total expence ratio) När myndighetens rabatt på fondavgiften beräknas används TER. I TER ingår fondens alla "]
[null,"                                       kostnader utom transaktionskostnader, kupongskatt, räntekostnader eller valutaförluster."]
[]
[null,"Sharpe-kvot:                   Ett mått på riskjusterad avkastning. Sharpe-kvot = (Värdeutvecklingen hos fonden - riskfria räntan) / Standardavvikelsen hos fonden (risk)."]

{"sheet":"Info Makro","index":15,"n_rows":27,"n_cols":2,"rows_kept":27,"cut":false,"hidden":false,"merged":[]}
[]
[]
[]
[]
[null,"För att kunna få tillgång till enkel sorteringsfunktionalitet i vissa blad behöver man aktivera makron."]
[null,"Detta görs genom att klicka på \"Aktivera makron\" när detta dokument öppnas (se nedan). "]
[null,"Har du valt att klicka på \"Inaktivera makron\" när detta dokument öppnades och vill kunna använda"]
[null,"sorteringsfunktionaliteten måste du stänga dokumentet och öppna på nytt med valet \"Aktivera makron\"."]
[]
[null,"Man kan även sortera manuellt om man inte vill utnyttja makrofunktionaliteten. Gå då direkt till"]
[null,"innehållsförteckningen genom att klicka på knappen här bredvid."]
[]
[]
[]
[]
[]
[]
[]
[]
[]
[]
[]
[]
[]
[null,"Kan du ändå inte sortera?"]
[null,"Då kan inställningarna till säkerhetsnivån för makron vara för hög på din dator. Ett alternativ"]
[null,"kan då vara att kontakta nätverksadministratören på din arbetsplats."]