{"text_format":"1","workbook":"xlsx","n_sheets":17,"sheets":["Innehåll","Fondval & marknadsvärde","10 fonder...","Fondstatistik","Fondstatistik - hållbarhet","Värdeutveckling - konto","Värdeutv. Premiepensionssystem","Värdeutv. fondrörelse per år","Marknadsv. & tillfört kapital","Värdeutveckling - fondrörelse","Värdeutv fondrörelse genomsnitt","Avkastning pp-systemet","Index, fondrörelsen","Marknadsv. och tillfört kapital","Avkastning sedan 2000","Beskrivning av mått","Info Makro"],"not_rendered":{"charts":5,"images":7,"macros":1,"external_links":0,"defined_names":29,"comments":1,"pivot_tables":0},"unopened":[],"bounds":{"document_bytes":16777216,"sheet_cells":100000,"rows_first":2000,"rows_last":500,"rows_between":2000,"halvings":0,"cell_chars":16384,"cell_head_chars":4096},"cells_cut":0,"cells_raw":0,"read":"whole","date_system":"1900"}

{"sheet":"Innehåll","index":0,"n_rows":24,"n_cols":2,"rows_kept":24,"cut":false,"hidden":false,"merged":[]}
[]
[]
[]
[]
[]
[]
[]
[null,"Månadsstatistik om premiepension"]
[]
[null,"INNEHÅLLSFÖRTECKNING"]
[null,"(klicka på resp rubrik för att komma till sidan)"]
[]
[null,"Fondval och aktuellt marknadsvärde"]
[null,"De tio mest valda fonderna m.m"]
[null,"Fondstatistik"]
[null,"Fondstatistik - Hållbarhet"]
[null,"Värdeutveckling - individuella konton"]
[null,"Värdeutveckling - pensionssystemet"]
[null,"Värdeutveckling för fondrörelsen per kalenderår"]
[null,"Marknadsvärde och tillfört kapital till fondrörelsen"]
{"$rows_left_out":5}
{"sheet":"Fondval & marknadsvärde","index":1,"n_rows":501,"n_cols":15,"rows_kept":501,"cut":false,"hidden":false,"merged":[]}
[]
[]
[]
[null,null,null,null,null,null,null,null,null,null,null,null,null,null,"Totalt marknadsvärde  "]
[null,null,null,null,null,null,null,null,null,null,null,null,null,null,{"$f":"ROUND(SUM(H23:H1000)/1000000000,0)","v":1639}]
["Antal fondval och marknadsvärde i fonderna 2021-02-28",null,null,null,null,null,null,null,null,null,null,null,null,null," miljarder kronor"]
["Nästa uppdatering: 2021-04-14"]
["Antal fondval, visar aktuellt läge vid månadsslut. "]
["Marknadsvärde = Fondandelar * Fondkurs * Valutakurs."]
[{"$f":"CONCATENATE(O4,O5,O6)","v":"Totalt marknadsvärde  1639 miljarder kronor"}]
[]
[]
[]
[]
[]
[]
[]
[]
["Klicka på kolumnnamnen för att sortera på respektive kolumn."]
[]
{"$rows_left_out":482}
{"sheet":"10 fonder...","index":2,"n_rows":52,"n_cols":10,"rows_kept":52,"cut":false,"hidden":false,"merged":[[9,2,9,4],[9,5,9,7],[23,5,23,7],[23,2,23,4]]}
[]
[]
[]
[]
[null,{"$f":"Fondstatistik!A5","v":"Fondstatistik per 2021-02-28"}]
[null,{"$f":"'Fondval & marknadsvärde'!A7","v":"Nästa uppdatering: 2021-04-14"}]
[]
[]
[null,"De tio mest valda fonderna"]
[null,"Fondnamn","Antal fondval",null,null,"Marknadsvärde",null,null,"Värdeutveckling"]
[null,null,"Kvinnor","Män","Total","Kvinnor","Män","Total","i år"]
[null,"AP7 Såfa - Statens årskullsförvaltningsalternativ",2308865,2536661,4845526,317751233083.13898,392658502116.302,710409735199.44104]
[null,"Swedbank Robur Technology A",151159,177871,329030,22552851665.696201,32059434432.530998,54612286098.227203,{"$f":"VLOOKUP($B$12:$B$21,Fondstatistik!$B$24:$Q$998,2,FALSE)","v":7}]
[null,"AMF Aktiefond Sverige",97392,101567,198959,10951833831.3592,14228365726.5942,25180199557.9534,{"$f":"VLOOKUP($B$12:$B$21,Fondstatistik!$B$24:$Q$998,2,FALSE)","v":4}]
[null,"Didner & Gerge Aktiefond",92013,97169,189182,12304820159.352501,15602898646.7572,27907718806.109798,{"$f":"VLOOKUP($B$12:$B$21,Fondstatistik!$B$24:$Q$998,2,FALSE)","v":7}]
[null,"AMF Aktiefond Världen",91610,93081,184691,9713990599.2476692,12413021523.931601,22127012123.179199,{"$f":"VLOOKUP($B$12:$B$21,Fondstatistik!$B$24:$Q$998,2,FALSE)","v":5}]
[null,"Swedbank Robur Aktiefond Pension",93932,75155,169087,11302653616.139099,11006796199.038099,22309449815.1772,{"$f":"VLOOKUP($B$12:$B$21,Fondstatistik!$B$24:$Q$998,2,FALSE)","v":5}]
[null,"Swedbank Robur Access Sverige A",80515,70601,151116,7421415935.48036,7880854313.8304396,15302270249.310801,{"$f":"VLOOKUP($B$12:$B$21,Fondstatistik!$B$24:$Q$998,2,FALSE)","v":5}]
[null,"AP7 Aktiefond",55977,82642,138619,9813115210.5453491,15989852416.6045,25802967627.149899,{"$f":"VLOOKUP($B$12:$B$21,Fondstatistik!$B$24:$Q$998,2,FALSE)","v":5}]
[null,"Swedbank Robur Transfer 80",63410,61990,125400,13513649102.322599,16132881412.843,29646530515.1656,{"$f":"VLOOKUP($B$12:$B$21,Fondstatistik!$B$24:$Q$998,2,FALSE)","v":5}]
{"$rows_left_out":33}
{"sheet":"Fondstatistik","index":3,"n_rows":503,"n_cols":20,"rows_kept":503,"cut":false,"hidden":false,"merged":[[19,2,19,9],[19,10,19,11]]}
[]
[]
[]
[]
["Fondstatistik per 2021-02-28"]
[{"$f":"'Fondval & marknadsvärde'!A7","v":"Nästa uppdatering: 2021-04-14"}]
[]
[]
[]
["Klicka på resp rubrik för att sortera (stigande eller fallande)"]
[]
[]
[]
[]
[]
[]
[]
["Klicka på kolumnnamnen för att sortera på respektive kolumn."]
[]
[null,null,"Värdeutveckling i SEK (%)",null,null,null,null,null,null,null,"Fondavgift (%)",null,null,"Sharpe-","Noterings-",null,"Svensk/"]
{"$rows_left_out":484}
{"sheet":"Fondstatistik - hållbarhet","index":4,"n_rows":502,"n_cols":22,"rows_kept":502,"cut":false,"hidden":false,"merged":[]}
[]
[]
[]
[]
["Fondstatistik - Hållbarhet per 2021-02-28"]
[{"$f":"'Fondval & marknadsvärde'!A7","v":"Nästa uppdatering: 2021-04-14"}]
[]
[]
[]
["Klicka på resp rubrik för att sortera (stigande eller fallande)"]
[]
[]
[]
[]
[]
[]
[]
["Klicka på kolumnnamnen för att sortera på respektive kolumn."]
[]
["Fondnummer","Fondnamn","Morningstar - ESG-Risk","ESG-Risk uppdaterad","Morningstar - låg CO2-märkning","CO2-märkning uppdaterad","Fonden beaktar miljöaspekter","Fonden beaktar sociala aspekter","Fonden beaktar bolagsstyrningsaspekter","Fonden väljer bort klusterbomber och personminor","Fonden väljer bort kemiska och biologiska vapen","Fonden väljer bort kärnvapen","Fonden väljer bort vapen och/eller krigsmateriel","Fonden väljer bort alkohol","Fonden väljer bort tobak","Fonden väljer bort kommersiell spelverksamhet","Fonden väljer bort pornografi","Fonden väljer bort fossila bränslen (olja/gas/kol)","Fonden väljer bort kol","Fonden väljer bort uran","Fonden väljer bort genetiskt modifierade organismer (GMO)","Fonden undviker att investera i samtliga identifierade bolag som inte följer internationella normer"]
{"$rows_left_out":483}
{"sheet":"Värdeutveckling - konto","index":5,"n_rows":45,"n_cols":3,"rows_kept":45,"cut":false,"hidden":false,"merged":[]}
[]
[]
[]
[]
[]
[]
[]
[null,null,"Nästa uppdatering 2021-04-16"]
[]
[]
[]
[]
[]
[]
[]
[]
[]
[]
[]
[]
{"$rows_left_out":26}
{"sheet":"Värdeutv. Premiepensionssystem","index":6,"n_rows":58,"n_cols":3,"rows_kept":58,"cut":false,"hidden":false,"merged":[]}
[]
[]
[]
[]
[null,{"$f":"'Värdeutveckling - konto'!C8","v":"Nästa uppdatering 2021-04-16"}]
[]
[]
[]
[]
[]
[]
[]
[]
[]
[]
[]
[]
[]
[]
[]
{"$rows_left_out":39}
{"sheet":"Värdeutv. fondrörelse per år","index":7,"n_rows":49,"n_cols":3,"rows_kept":49,"cut":false,"hidden":false,"merged":[]}
[]
[]
[]
[]
[null,{"$f":"'Värdeutveckling - konto'!C8","v":"Nästa uppdatering 2021-04-16"}]
[]
[]
[]
[]
[]
[]
[]
[]
[]
[]
[]
[]
[]
[]
[]
{"$rows_left_out":30}
{"sheet":"Marknadsv. & tillfört kapital","index":8,"n_rows":46,"n_cols":3,"rows_kept":46,"cut":false,"hidden":false,"merged":[]}
[]
[]
[]
[]
[]
[]
[null,{"$f":"'Värdeutveckling - konto'!C8","v":"Nästa uppdatering 2021-04-16"}]
[]
[]
[]
[]
[]
[]
[]
[]
[]
[]
[]
[]
[]
{"$rows_left_out":27}
{"sheet":"Värdeutveckling - fondrörelse","index":9,"n_rows":44,"n_cols":3,"rows_kept":44,"cut":false,"hidden":false,"merged":[]}
[]
[]
[]
[]
[null,{"$f":"'Värdeutveckling - konto'!C8","v":"Nästa uppdatering 2021-04-16"}]
[]
[]
[]
[]
[]
[]
[]
[]
[]
[]
[]
[]
[]
[]
[]
{"$rows_left_out":25}
{"sheet":"Värdeutv fondrörelse genomsnitt","index":10,"n_rows":45,"n_cols":3,"rows_kept":45,"cut":false,"hidden":false,"merged":[]}
[]
[]
[]
[]
[null,{"$f":"'Värdeutveckling - konto'!C8","v":"Nästa uppdatering 2021-04-16"}]
[]
[]
[]
[]
[]
[]
[]
[]
[]
[]
[]
[]
[]
[]
[]
{"$rows_left_out":26}
{"sheet":"Avkastning pp-systemet","index":11,"n_rows":270,"n_cols":6,"rows_kept":270,"cut":false,"hidden":false,"merged":[[24,2,25,2],[24,3,25,3],[24,4,25,4],[24,5,25,5]]}
[]
[]
[]
[]
[null,"Värdeutveckling - Premiepensionssystemet"]
[null,{"$f":"'Värdeutveckling - konto'!C8","v":"Nästa uppdatering 2021-04-16"}]
[null,"Siffrorna omfattar både avkastningen i fondrörelsen och avkastningen av pengarna fram till tidpunkten då de placerades i fonderna."]
[null,"Kapitalviktad avkastning anger genomsnittlig årlig utveckling för en genomsnittlig persons premiepensionskonto. "]
[null,"Måttet kan jämföras med räntan på ett bankkonto."]
[null,"Den kapitalviktade avkastningen kan inte jämföras med marknadsindex eller med enskilda fonders avkastning. "]
[null,"Balansindex är den siffra med vilken inkomstpensionen räknas upp årligen och är jämförbar med den kapitalviktade årsavkastningen."]
[]
[null,"I tabellen nedan kan man därför jämföra den genomsnittlige personens avkastning i premiepensionssystemet "]
[null,"med personens avkastning i inkomstpensionen. "]
[]
[null,"Med årsavkastning avses genomsnittlig årsavkastning sedan start."]
[]
[]
[]
[]
{"$rows_left_out":251}
{"sheet":"Index, fondrörelsen","index":12,"n_rows":22,"n_cols":23,"rows_kept":22,"cut":false,"hidden":false,"merged":[]}
[]
[]
[]
[" "]
[null,"Värdeutveckling - fondrörelsen per kalenderår"]
[null,{"$f":"'Värdeutveckling - konto'!C8","v":"Nästa uppdatering 2021-04-16"}]
[null,"Avkastningen i fondrörelsen mäter avkastningen på en genomsnittlig krona som sattes in i början på året. "]
[null,"Det kan jämföras med marknadsindex och enskilda fonders avkastning. "]
[null,"Rabatter på fondavgifter, myndighetens avgift och arvsvinster är inte medräknade."]
[]
[]
[]
[]
[null,"Värdeutveckling",2001,2002,2003,2004,2005,2006,2007,2008,2009,2010,2011,2012,2013,2014,2015,2016,2017,2018,2019,2020,"2021-02-28"]
[null,"Fondrörelsen 1)",-0.111,-0.31223079839764201,0.1782730775091621,8.7501758829949594E-2,0.30552648011758543,0.12140116450721394,5.6636805614445285E-2,-0.34156819000074978,0.34685505788951732,0.12151293044644662,-0.10687426681227297,0.12125473461444458,0.21099999999999999,0.20699999999999999,6.4000000000000001E-2,0.10855501959583491,0.12569489215081098,-3.40606892186055E-2,0.29532946013285644,6.3564627315921163E-2,4.1091085141940598E-2]
[null,"Sjunde AP-fonden 2)",-0.106,-0.26700000000000002,0.187,0.10100000000000001,0.251,0.105,4.7E-2,-0.36199999999999999,0.35141800246609134,0.14644453351666153,-0.10536246609942557,0.17497988455497548,0.318,0.29099999999999998,6.2E-2,0.15138751375459392,0.16351530485196797,-2.7275872892043029E-2,0.32172396409848503,4.4137122102966497E-2,4.7927430565318785E-2]
[null,"Traditionell försäkring",4.1691826923077047E-2,3.8685865587554158E-2,3.3331727793022514E-2,4.8354052976949724E-2,5.1664705500169772E-2,5.9999993759661807E-2,5.6646964711991155E-2,2.1523620769253071E-2,1.0750188371345448E-2,4.5851349005140873E-2,3.7478052648876936E-2,5.000001243286567E-2,4.4115418197783862E-2,6.8234846767015522E-2,0.12601672774751971,4.9905351813315679E-2,5.08565189590693E-2,7.4991880878938932E-2,6.5029532844956162E-2,5.818167121232265E-2,1.2382531949278519E-2]
[]
[]
[null,"1) I beräkningen av värdeutvecklingen i fondrörelsen ingår alla fonder på fondtorget inklusive AP7 Aktiefond och AP7 Räntefond."]
{"$rows_left_out":3}
{"sheet":"Marknadsv. och tillfört kapital","index":13,"n_rows":17,"n_cols":24,"rows_kept":17,"cut":false,"hidden":false,"merged":[]}
[]
[]
[]
[]
[]
[null,"Marknadsvärde och tillfört kapital till fondrörelsen"]
[null,{"$f":"'Värdeutveckling - konto'!C8","v":"Nästa uppdatering 2021-04-16"}]
[null,"Tillfört kapital är pengar från den tillfälliga förvaltningen (inklusive ränta) samt återförda fondavgifter och arvsvinster. "]
[null,"Från det tillförda kapitalet har det dragits av för pensionsutbetalningar, myndighetens avgift, samt överföringar till "]
[null,"traditionell försäkring. Jämförelsen mellan marknadsvärde och tillfört kapital ger alltså inte en fullständig bild av "]
[null,"utvecklingen av de inbetalda pensionsrätterna."]
[]
[]
[]
[null,"Fondrörelsen","2000-12-31","2001-12-31","2002-12-31","2003-12-31","2004-12-31","2005-12-31","2006-12-31","2007-12-31","2008-12-31","2009-12-31","2010-12-31","2011-12-31","2012-12-31","2013-12-31","2014-12-31","2015-12-31","2016-12-31","2017-12-31","2018-12-31","2019-12-31","2020-12-31","2021-02-28"]
[null,"Netto tillfört kapital, mdr",55.831616023629408,74.033547998326426,93.93715098490317,114.64956724755694,136.62021154457284,159.77779842054943,209,235.50159071018251,263.98657166722467,293.39683174242759,323.04324834873717,354.29697772737427,387,421,456,496,538.21494048724287,584.96366813040015,634.8794232173783,685.09053430216454,727.91494493496543,726.49971601622178]
[null,"Marknadsvärde, mdr",52.735199475111202,65.023593666597904,59.275358189472996,93.920076415257597,124.75628531142399,192.35696213467801,267,308.29568458589898,230.23493756186801,340.16227208294498,408.47751268748601,393.15689279941199,471,602,759,839,959.84765629860874,1110.00111086684,1102.5914045278,1458.0485443171799,1578.6694624704198,1638.8377304011101]

{"sheet":"Avkastning sedan 2000","index":14,"n_rows":269,"n_cols":11,"rows_kept":269,"cut":false,"hidden":false,"merged":[[19,1,20,2],[21,2,22,2],[21,3,22,3],[19,7,20,10],[21,9,22,9],[21,10,22,10],[21,7,22,7],[21,8,22,8],[23,13,24,13],[23,14,24,14],[21,4,22,4],[21,5,22,5],[23,11,24,11],[23,12,24,12]]}
[]
[]
[]
[]
[null,"Värdeutveckling - fondrörelsen och traditionell försäkring i genomsnitt per år"]
[null,{"$f":"'Värdeutveckling - konto'!C8","v":"Nästa uppdatering 2021-04-16"}]
[]
[null,"Tidsviktad avkastning (TVA), mäter avkastningen på en genomsnittlig krona som sattes in i premiepensionssystemet 2000-12-13. "]
[null,"Premiepensionsindex kan jämföras med marknadsindex och enskilda fonders avkastning. Rabatten på fondavgiften,"]
[null," myndighetens avgift och arvsvinster är inte medräknade. "]
[]
[null,"Real avkastning = avkastning/inflation (KPI) "]
[null,"Med årsavkastningn menas genomsnittlig avkastning sedan start. "]
[]
[]
[]
[]
[]
[]
[null,"Fondförsäkring",null,null,null,null,null,"Traditionell försäkring"]
{"$rows_left_out":250}
{"sheet":"Beskrivning av mått","index":15,"n_rows":29,"n_cols":3,"rows_kept":29,"cut":false,"hidden":false,"merged":[]}
[]
[]
[]
[]
[null,"Beskrivning av mått"]
[]
[]
[]
[]
[null,"Snitt 5 år:","Geometriska medelvärdet av fondernas värdeutveckling i SEK för de senaste 60 månaderna (5 år)."]
[]
[null,"Risk:","Standardavvikelse, 36 månader, anger hur kursutvecklingen avviker från medelvärdet."]
[]
[null,"Fondavgift, % netto:","TER minus myndighetens rabatt, pensionsspararens avgift till förvaltaren."]
[]
[null,"Fondavgift, % brutto:","Motsvarar TER. "]
[]
[null,"TER:","(Total expence ratio) När myndighetens rabatt på fondavgiften beräknas används TER. I TER ingår fondens alla kostnader utom transaktionskostnader, kupongskatt, räntekostnader eller valutaförluster."]
[]
[]
{"$rows_left_out":10}
{"sheet":"Info Makro","index":16,"n_rows":27,"n_cols":2,"rows_kept":27,"cut":false,"hidden":false,"merged":[]}
[]
[]
[]
[]
[null,"För att kunna få tillgång till enkel sorteringsfunktionalitet i vissa blad behöver man aktivera makron."]
[null,"Detta görs genom att klicka på \"Aktivera makron\" när detta dokument öppnas (se nedan). "]
[null,"Har du valt att klicka på \"Inaktivera makron\" när detta dokument öppnades och vill kunna använda"]
[null,"sorteringsfunktionaliteten måste du stänga dokumentet och öppna på nytt med valet \"Aktivera makron\"."]
[]
[null,"Man kan även sortera manuellt om man inte vill utnyttja makrofunktionaliteten. Gå då direkt till"]
[null,"innehållsförteckningen genom att klicka på knappen här bredvid."]
[]
[]
[]
[]
[]
[]
[]
[]
[]
{"$rows_left_out":7}